0s autopkgtest [11:45:04]: starting date and time: 2025-05-06 11:45:04+0000
0s autopkgtest [11:45:04]: git checkout: 9986aa8c Merge branch 'skia/fix_network_interface' into 'ubuntu/production'
0s autopkgtest [11:45:04]: host juju-7f2275-prod-proposed-migration-environment-2; command line: /home/ubuntu/autopkgtest/runner/autopkgtest --output-dir /tmp/autopkgtest-work.8vyu1y43/out --timeout-copy=6000 --setup-commands /home/ubuntu/autopkgtest-cloud/worker-config-production/setup-canonical.sh --apt-pocket=proposed=src:sphinx,src:python-hypothesis,src:python-redis,src:python-typing-extensions --apt-upgrade kombu --timeout-short=300 --timeout-copy=20000 --timeout-build=20000 '--env=ADT_TEST_TRIGGERS=sphinx/8.2.3-1 python-hypothesis/6.130.5-1 python-redis/5.2.1-1 python-typing-extensions/4.13.2-1' -- ssh -s /home/ubuntu/autopkgtest/ssh-setup/nova -- --flavor autopkgtest-cpu2-ram4-disk20-s390x --security-groups autopkgtest-juju-7f2275-prod-proposed-migration-environment-2@sto01-s390x-8.secgroup --name adt-questing-s390x-kombu-20250506-114504-juju-7f2275-prod-proposed-migration-environment-2-ee21fab7-85d7-446b-82a0-44eb3944a2aa --image adt/ubuntu-questing-s390x-server --keyname testbed-juju-7f2275-prod-proposed-migration-environment-2 --net-id=net_prod-autopkgtest-workers-s390x -e TERM=linux --mirror=http://ftpmaster.internal/ubuntu/
119s autopkgtest [11:47:03]: testbed dpkg architecture: s390x
119s autopkgtest [11:47:03]: testbed apt version: 3.0.0
120s autopkgtest [11:47:04]: @@@@@@@@@@@@@@@@@@@@ test bed setup
120s autopkgtest [11:47:04]: testbed release detected to be: None
122s autopkgtest [11:47:06]: updating testbed package index (apt update)
123s Get:1 http://ftpmaster.internal/ubuntu questing-proposed InRelease [110 kB]
123s Hit:2 http://ftpmaster.internal/ubuntu questing InRelease
123s Hit:3 http://ftpmaster.internal/ubuntu questing-updates InRelease
123s Hit:4 http://ftpmaster.internal/ubuntu questing-security InRelease
123s Get:5 http://ftpmaster.internal/ubuntu questing-proposed/universe Sources [595 kB]
123s Get:6 http://ftpmaster.internal/ubuntu questing-proposed/multiverse Sources [27.3 kB]
123s Get:7 http://ftpmaster.internal/ubuntu questing-proposed/main Sources [72.4 kB]
123s Get:8 http://ftpmaster.internal/ubuntu questing-proposed/main s390x Packages [136 kB]
123s Get:9 http://ftpmaster.internal/ubuntu questing-proposed/universe s390x Packages [612 kB]
124s Get:10 http://ftpmaster.internal/ubuntu questing-proposed/multiverse s390x Packages [15.0 kB]
124s Fetched 1567 kB in 2s (743 kB/s)
128s Reading package lists...
130s autopkgtest [11:47:14]: upgrading testbed (apt dist-upgrade and autopurge)
130s Reading package lists...
131s Building dependency tree...
131s Reading state information...
132s Calculating upgrade...Starting pkgProblemResolver with broken count: 0
132s Starting 2 pkgProblemResolver with broken count: 0
132s Done
133s Entering ResolveByKeep
133s
134s Calculating upgrade...
134s The following packages will be upgraded:
135s libperl5.40 perl perl-base perl-modules-5.40 python3-dbus
135s python3-typing-extensions
136s 6 upgraded, 0 newly installed, 0 to remove and 0 not upgraded.
136s Need to get 10.6 MB of archives.
136s After this operation, 117 kB of additional disk space will be used.
136s Get:1 http://ftpmaster.internal/ubuntu questing/main s390x libperl5.40 s390x 5.40.1-3 [4972 kB]
137s Get:2 http://ftpmaster.internal/ubuntu questing/main s390x perl s390x 5.40.1-3 [262 kB]
137s Get:3 http://ftpmaster.internal/ubuntu questing/main s390x perl-base s390x 5.40.1-3 [1954 kB]
137s Get:4 http://ftpmaster.internal/ubuntu questing/main s390x perl-modules-5.40 all 5.40.1-3 [3217 kB]
137s Get:5 http://ftpmaster.internal/ubuntu questing/main s390x python3-dbus s390x 1.4.0-1 [102 kB]
137s Get:6 http://ftpmaster.internal/ubuntu questing-proposed/main s390x python3-typing-extensions all 4.13.2-1 [82.6 kB]
141s Fetched 10.6 MB in 2s (5286 kB/s)
142s (Reading database ...
(Reading database ... 5%
(Reading database ... 10%
(Reading database ... 15%
(Reading database ... 20%
(Reading database ... 25%
(Reading database ... 30%
(Reading database ... 35%
(Reading database ... 40%
(Reading database ... 45%
(Reading database ... 50%
(Reading database ... 55%
(Reading database ... 60%
(Reading database ... 65%
(Reading database ... 70%
(Reading database ... 75%
(Reading database ... 80%
(Reading database ... 85%
(Reading database ... 90%
(Reading database ... 95%
(Reading database ... 100%
(Reading database ... 59837 files and directories currently installed.)
142s Preparing to unpack .../libperl5.40_5.40.1-3_s390x.deb ...
142s Unpacking libperl5.40:s390x (5.40.1-3) over (5.40.1-2ubuntu0.1) ...
146s Preparing to unpack .../perl_5.40.1-3_s390x.deb ...
146s Unpacking perl (5.40.1-3) over (5.40.1-2ubuntu0.1) ...
146s Preparing to unpack .../perl-base_5.40.1-3_s390x.deb ...
146s Unpacking perl-base (5.40.1-3) over (5.40.1-2ubuntu0.1) ...
149s Setting up perl-base (5.40.1-3) ...
149s (Reading database ...
(Reading database ... 5%
(Reading database ... 10%
(Reading database ... 15%
(Reading database ... 20%
(Reading database ... 25%
(Reading database ... 30%
(Reading database ... 35%
(Reading database ... 40%
(Reading database ... 45%
(Reading database ... 50%
(Reading database ... 55%
(Reading database ... 60%
(Reading database ... 65%
(Reading database ... 70%
(Reading database ... 75%
(Reading database ... 80%
(Reading database ... 85%
(Reading database ... 90%
(Reading database ... 95%
(Reading database ... 100%
(Reading database ... 59837 files and directories currently installed.)
149s Preparing to unpack .../perl-modules-5.40_5.40.1-3_all.deb ...
149s Unpacking perl-modules-5.40 (5.40.1-3) over (5.40.1-2ubuntu0.1) ...
153s Preparing to unpack .../python3-dbus_1.4.0-1_s390x.deb ...
154s Unpacking python3-dbus (1.4.0-1) over (1.3.2-5build5) ...
154s Preparing to unpack .../python3-typing-extensions_4.13.2-1_all.deb ...
154s Unpacking python3-typing-extensions (4.13.2-1) over (4.12.2-2) ...
155s Setting up python3-dbus (1.4.0-1) ...
155s Setting up python3-typing-extensions (4.13.2-1) ...
156s Setting up perl-modules-5.40 (5.40.1-3) ...
156s Setting up libperl5.40:s390x (5.40.1-3) ...
156s Setting up perl (5.40.1-3) ...
156s Processing triggers for man-db (2.13.1-1) ...
161s Processing triggers for libc-bin (2.41-6ubuntu1) ...
163s Reading package lists...
164s Building dependency tree...
164s Reading state information...
165s Starting pkgProblemResolver with broken count: 0
165s Starting 2 pkgProblemResolver with broken count: 0
165s Done
166s Solving dependencies...
167s 0 upgraded, 0 newly installed, 0 to remove and 0 not upgraded.
171s autopkgtest [11:47:55]: testbed running kernel: Linux 6.14.0-15-generic #15-Ubuntu SMP Sun Apr 6 13:39:00 UTC 2025
171s autopkgtest [11:47:55]: @@@@@@@@@@@@@@@@@@@@ apt-source kombu
174s Get:1 http://ftpmaster.internal/ubuntu questing/main kombu 5.4.2-3 (dsc) [2925 B]
174s Get:2 http://ftpmaster.internal/ubuntu questing/main kombu 5.4.2-3 (tar) [483 kB]
174s Get:3 http://ftpmaster.internal/ubuntu questing/main kombu 5.4.2-3 (diff) [12.5 kB]
175s gpgv: Signature made Mon Feb 17 06:47:56 2025 UTC
175s gpgv: using RSA key 8F6DE104377F3B11E741748731F3144544A1741A
175s gpgv: issuer "tchet@debian.org"
175s gpgv: Can't check signature: No public key
175s dpkg-source: warning: cannot verify inline signature for ./kombu_5.4.2-3.dsc: no acceptable signature found
175s autopkgtest [11:47:59]: testing package kombu version 5.4.2-3
175s autopkgtest [11:47:59]: build not needed
175s autopkgtest [11:47:59]: test upstream: preparing testbed
176s Reading package lists...
178s Building dependency tree...
178s Reading state information...
178s Starting pkgProblemResolver with broken count: 0
178s Starting 2 pkgProblemResolver with broken count: 0
178s Done
180s The following NEW packages will be installed:
180s fontconfig-config fonts-dejavu-core fonts-dejavu-mono gir1.2-secret-1
180s libcairo-gobject2 libcairo2 libfontconfig1 libfreetype6 libjs-jquery
180s libjs-sphinxdoc libjs-underscore libpixman-1-0 libsecret-1-0
180s libsecret-common libxcb-render0 libxcb-shm0 libxrender1 python-kombu-doc
180s python3-adal python3-aiohappyeyeballs python3-aiohttp python3-aiosignal
180s python3-all python3-amqp python3-async-timeout python3-avro python3-azure
180s python3-azure-storage python3-bson python3-cairo python3-click
180s python3-colorama python3-dnspython python3-frozenlist python3-gi-cairo
180s python3-greenlet python3-hypothesis python3-iniconfig python3-isodate
180s python3-joblib python3-kombu python3-marshmallow python3-msal
180s python3-msal-extensions python3-msgpack python3-msrest python3-msrestazure
180s python3-multidict python3-nltk python3-pluggy python3-portalocker
180s python3-psutil python3-pydash python3-pymongo python3-pyro5 python3-pytest
180s python3-pytz python3-redis python3-regex python3-requests-oauthlib
180s python3-ruamel.yaml python3-ruamel.yaml.clib python3-serpent
180s python3-sortedcontainers python3-sqlalchemy python3-strictyaml python3-tqdm
180s python3-tz python3-vine python3-websocket python3-yarl
180s 0 upgraded, 71 newly installed, 0 to remove and 0 not upgraded.
180s Need to get 26.8 MB of archives.
180s After this operation, 626 MB of additional disk space will be used.
180s Get:1 http://ftpmaster.internal/ubuntu questing/universe s390x python3-serpent all 1.41-2 [10.8 kB]
180s Get:2 http://ftpmaster.internal/ubuntu questing/universe s390x python3-pyro5 all 5.15-1ubuntu1 [64.8 kB]
180s Get:3 http://ftpmaster.internal/ubuntu questing/main s390x fonts-dejavu-mono all 2.37-8 [502 kB]
180s Get:4 http://ftpmaster.internal/ubuntu questing/main s390x fonts-dejavu-core all 2.37-8 [835 kB]
180s Get:5 http://ftpmaster.internal/ubuntu questing/main s390x fontconfig-config s390x 2.15.0-2.2ubuntu1 [37.9 kB]
180s Get:6 http://ftpmaster.internal/ubuntu questing/main s390x libsecret-common all 0.21.7-1 [5160 B]
180s Get:7 http://ftpmaster.internal/ubuntu questing/main s390x libsecret-1-0 s390x 0.21.7-1 [115 kB]
180s Get:8 http://ftpmaster.internal/ubuntu questing/main s390x gir1.2-secret-1 s390x 0.21.7-1 [9338 B]
180s Get:9 http://ftpmaster.internal/ubuntu questing/main s390x libfreetype6 s390x 2.13.3+dfsg-1 [431 kB]
180s Get:10 http://ftpmaster.internal/ubuntu questing/main s390x libfontconfig1 s390x 2.15.0-2.2ubuntu1 [150 kB]
180s Get:11 http://ftpmaster.internal/ubuntu questing/main s390x libpixman-1-0 s390x 0.44.0-3 [201 kB]
180s Get:12 http://ftpmaster.internal/ubuntu questing/main s390x libxcb-render0 s390x 1.17.0-2 [17.0 kB]
180s Get:13 http://ftpmaster.internal/ubuntu questing/main s390x libxcb-shm0 s390x 1.17.0-2 [5862 B]
180s Get:14 http://ftpmaster.internal/ubuntu questing/main s390x libxrender1 s390x 1:0.9.12-1 [20.9 kB]
180s Get:15 http://ftpmaster.internal/ubuntu questing/main s390x libcairo2 s390x 1.18.4-1 [580 kB]
180s Get:16 http://ftpmaster.internal/ubuntu questing/main s390x libcairo-gobject2 s390x 1.18.4-1 [127 kB]
180s Get:17 http://ftpmaster.internal/ubuntu questing/main s390x libjs-jquery all 3.6.1+dfsg+~3.5.14-1 [328 kB]
180s Get:18 http://ftpmaster.internal/ubuntu questing/main s390x libjs-underscore all 1.13.4~dfsg+~1.11.4-3 [118 kB]
180s Get:19 http://ftpmaster.internal/ubuntu questing-proposed/main s390x libjs-sphinxdoc all 8.2.3-1 [27.8 kB]
180s Get:20 http://ftpmaster.internal/ubuntu questing/main s390x python-kombu-doc all 5.4.2-3 [427 kB]
180s Get:21 http://ftpmaster.internal/ubuntu questing/universe s390x python3-adal all 1.2.7-5 [33.0 kB]
180s Get:22 http://ftpmaster.internal/ubuntu questing/universe s390x python3-aiohappyeyeballs all 2.6.1-1 [11.1 kB]
180s Get:23 http://ftpmaster.internal/ubuntu questing/universe s390x python3-multidict s390x 6.4.3-1 [49.6 kB]
180s Get:24 http://ftpmaster.internal/ubuntu questing/universe s390x python3-yarl s390x 1.13.1-1build2 [96.1 kB]
180s Get:25 http://ftpmaster.internal/ubuntu questing/universe s390x python3-async-timeout all 5.0.1-1 [6830 B]
180s Get:26 http://ftpmaster.internal/ubuntu questing/universe s390x python3-frozenlist s390x 1.5.0-1build2 [50.3 kB]
180s Get:27 http://ftpmaster.internal/ubuntu questing/universe s390x python3-aiosignal all 1.3.2-1 [5182 B]
180s Get:28 http://ftpmaster.internal/ubuntu questing/universe s390x python3-aiohttp s390x 3.10.11-1build1 [313 kB]
180s Get:29 http://ftpmaster.internal/ubuntu questing/main s390x python3-all s390x 3.13.3-1 [882 B]
180s Get:30 http://ftpmaster.internal/ubuntu questing/universe s390x python3-avro all 1.12.0+dfsg-1 [75.3 kB]
180s Get:31 http://ftpmaster.internal/ubuntu questing/universe s390x python3-isodate all 0.7.0-1 [18.6 kB]
180s Get:32 http://ftpmaster.internal/ubuntu questing/universe s390x python3-requests-oauthlib all 1.3.1-1 [18.8 kB]
180s Get:33 http://ftpmaster.internal/ubuntu questing/universe s390x python3-msrest all 0.6.21-5 [48.7 kB]
180s Get:34 http://ftpmaster.internal/ubuntu questing/universe s390x python3-msrestazure all 0.6.4-4 [27.1 kB]
180s Get:35 http://ftpmaster.internal/ubuntu questing/universe s390x python3-azure-storage all 20250304+git-1 [300 kB]
180s Get:36 http://ftpmaster.internal/ubuntu questing/universe s390x python3-colorama all 0.4.6-4 [32.1 kB]
180s Get:37 http://ftpmaster.internal/ubuntu questing/main s390x python3-dnspython all 2.7.0-1ubuntu1 [167 kB]
180s Get:38 http://ftpmaster.internal/ubuntu questing/universe s390x python3-marshmallow all 3.26.1-0.2 [47.5 kB]
180s Get:39 http://ftpmaster.internal/ubuntu questing/universe s390x python3-msal all 1.32.3-1 [101 kB]
180s Get:40 http://ftpmaster.internal/ubuntu questing/main s390x python3-cairo s390x 1.27.0-2 [120 kB]
180s Get:41 http://ftpmaster.internal/ubuntu questing/main s390x python3-gi-cairo s390x 3.50.0-4build1 [8072 B]
180s Get:42 http://ftpmaster.internal/ubuntu questing/universe s390x python3-portalocker all 3.1.1-1 [20.9 kB]
180s Get:43 http://ftpmaster.internal/ubuntu questing/universe s390x python3-msal-extensions all 1.3.1-1 [18.2 kB]
180s Get:44 http://ftpmaster.internal/ubuntu questing/main s390x python3-click all 8.2.0+0.really.8.1.8-1 [80.0 kB]
180s Get:45 http://ftpmaster.internal/ubuntu questing/universe s390x python3-joblib all 1.4.2-3 [205 kB]
180s Get:46 http://ftpmaster.internal/ubuntu questing/universe s390x python3-regex s390x 0.1.20241106-1build1 [304 kB]
180s Get:47 http://ftpmaster.internal/ubuntu questing/universe s390x python3-tqdm all 4.67.1-3 [91.6 kB]
180s Get:48 http://ftpmaster.internal/ubuntu questing/universe s390x python3-nltk all 3.9.1-2 [1006 kB]
180s Get:49 http://ftpmaster.internal/ubuntu questing/main s390x python3-psutil s390x 5.9.8-2build3 [195 kB]
180s Get:50 http://ftpmaster.internal/ubuntu questing/universe s390x python3-pydash all 8.0.5-1 [79.2 kB]
180s Get:51 http://ftpmaster.internal/ubuntu questing/universe s390x python3-ruamel.yaml.clib s390x 0.2.12+ds-1build1 [151 kB]
180s Get:52 http://ftpmaster.internal/ubuntu questing/universe s390x python3-ruamel.yaml all 0.18.10+ds-1 [127 kB]
181s Get:53 http://ftpmaster.internal/ubuntu questing/universe s390x python3-strictyaml all 1.6.1-3 [89.1 kB]
181s Get:54 http://ftpmaster.internal/ubuntu questing/universe s390x python3-websocket all 1.8.0-2 [38.5 kB]
181s Get:55 http://ftpmaster.internal/ubuntu questing/universe s390x python3-azure all 20250304+git-1 [15.9 MB]
182s Get:56 http://ftpmaster.internal/ubuntu questing/main s390x python3-bson all 4.10.1-5build1 [42.9 kB]
182s Get:57 http://ftpmaster.internal/ubuntu questing/main s390x python3-sortedcontainers all 2.4.0-2 [27.6 kB]
182s Get:58 http://ftpmaster.internal/ubuntu questing-proposed/universe s390x python3-hypothesis all 6.130.5-1 [341 kB]
182s Get:59 http://ftpmaster.internal/ubuntu questing/universe s390x python3-iniconfig all 1.1.1-2 [6024 B]
182s Get:60 http://ftpmaster.internal/ubuntu questing/main s390x python3-vine all 5.1.0+dfsg-1 [14.2 kB]
182s Get:61 http://ftpmaster.internal/ubuntu questing/main s390x python3-amqp all 5.3.1-2 [43.5 kB]
182s Get:62 http://ftpmaster.internal/ubuntu questing/main s390x python3-kombu all 5.4.2-3 [145 kB]
182s Get:63 http://ftpmaster.internal/ubuntu questing/main s390x python3-msgpack s390x 1.0.3-3build4 [87.7 kB]
182s Get:64 http://ftpmaster.internal/ubuntu questing/universe s390x python3-pluggy all 1.5.0-1 [21.0 kB]
182s Get:65 http://ftpmaster.internal/ubuntu questing/main s390x python3-pymongo all 4.10.1-5build1 [227 kB]
182s Get:66 http://ftpmaster.internal/ubuntu questing/universe s390x python3-pytest all 8.3.5-1 [252 kB]
182s Get:67 http://ftpmaster.internal/ubuntu questing/main s390x python3-pytz all 2025.1-3 [162 kB]
182s Get:68 http://ftpmaster.internal/ubuntu questing-proposed/universe s390x python3-redis all 5.2.1-1 [221 kB]
182s Get:69 http://ftpmaster.internal/ubuntu questing/main s390x python3-greenlet s390x 3.1.0-1build1 [162 kB]
182s Get:70 http://ftpmaster.internal/ubuntu questing/main s390x python3-sqlalchemy all 2.0.38+ds1-0ubuntu2 [1215 kB]
182s Get:71 http://ftpmaster.internal/ubuntu questing/main s390x python3-tz all 2025.1-3 [1866 B]
185s Fetched 26.8 MB in 2s (12.1 MB/s)
185s Selecting previously unselected package python3-serpent.
185s (Reading database ...
(Reading database ... 5%
(Reading database ... 10%
(Reading database ... 15%
(Reading database ... 20%
(Reading database ... 25%
(Reading database ... 30%
(Reading database ... 35%
(Reading database ... 40%
(Reading database ... 45%
(Reading database ... 50%
(Reading database ... 55%
(Reading database ... 60%
(Reading database ... 65%
(Reading database ... 70%
(Reading database ... 75%
(Reading database ... 80%
(Reading database ... 85%
(Reading database ... 90%
(Reading database ... 95%
(Reading database ... 100%
(Reading database ... 59837 files and directories currently installed.)
185s Preparing to unpack .../00-python3-serpent_1.41-2_all.deb ...
185s Unpacking python3-serpent (1.41-2) ...
185s Selecting previously unselected package python3-pyro5.
185s Preparing to unpack .../01-python3-pyro5_5.15-1ubuntu1_all.deb ...
185s Unpacking python3-pyro5 (5.15-1ubuntu1) ...
185s Selecting previously unselected package fonts-dejavu-mono.
185s Preparing to unpack .../02-fonts-dejavu-mono_2.37-8_all.deb ...
185s Unpacking fonts-dejavu-mono (2.37-8) ...
185s Selecting previously unselected package fonts-dejavu-core.
185s Preparing to unpack .../03-fonts-dejavu-core_2.37-8_all.deb ...
185s Unpacking fonts-dejavu-core (2.37-8) ...
186s Selecting previously unselected package fontconfig-config.
186s Preparing to unpack .../04-fontconfig-config_2.15.0-2.2ubuntu1_s390x.deb ...
187s Unpacking fontconfig-config (2.15.0-2.2ubuntu1) ...
187s Selecting previously unselected package libsecret-common.
187s Preparing to unpack .../05-libsecret-common_0.21.7-1_all.deb ...
187s Unpacking libsecret-common (0.21.7-1) ...
187s Selecting previously unselected package libsecret-1-0:s390x.
187s Preparing to unpack .../06-libsecret-1-0_0.21.7-1_s390x.deb ...
187s Unpacking libsecret-1-0:s390x (0.21.7-1) ...
187s Selecting previously unselected package gir1.2-secret-1:s390x.
187s Preparing to unpack .../07-gir1.2-secret-1_0.21.7-1_s390x.deb ...
187s Unpacking gir1.2-secret-1:s390x (0.21.7-1) ...
187s Selecting previously unselected package libfreetype6:s390x.
187s Preparing to unpack .../08-libfreetype6_2.13.3+dfsg-1_s390x.deb ...
187s Unpacking libfreetype6:s390x (2.13.3+dfsg-1) ...
187s Selecting previously unselected package libfontconfig1:s390x.
187s Preparing to unpack .../09-libfontconfig1_2.15.0-2.2ubuntu1_s390x.deb ...
187s Unpacking libfontconfig1:s390x (2.15.0-2.2ubuntu1) ...
187s Selecting previously unselected package libpixman-1-0:s390x.
187s Preparing to unpack .../10-libpixman-1-0_0.44.0-3_s390x.deb ...
187s Unpacking libpixman-1-0:s390x (0.44.0-3) ...
188s Selecting previously unselected package libxcb-render0:s390x.
188s Preparing to unpack .../11-libxcb-render0_1.17.0-2_s390x.deb ...
188s Unpacking libxcb-render0:s390x (1.17.0-2) ...
188s Selecting previously unselected package libxcb-shm0:s390x.
188s Preparing to unpack .../12-libxcb-shm0_1.17.0-2_s390x.deb ...
188s Unpacking libxcb-shm0:s390x (1.17.0-2) ...
188s Selecting previously unselected package libxrender1:s390x.
188s Preparing to unpack .../13-libxrender1_1%3a0.9.12-1_s390x.deb ...
188s Unpacking libxrender1:s390x (1:0.9.12-1) ...
188s Selecting previously unselected package libcairo2:s390x.
188s Preparing to unpack .../14-libcairo2_1.18.4-1_s390x.deb ...
188s Unpacking libcairo2:s390x (1.18.4-1) ...
188s Selecting previously unselected package libcairo-gobject2:s390x.
188s Preparing to unpack .../15-libcairo-gobject2_1.18.4-1_s390x.deb ...
188s Unpacking libcairo-gobject2:s390x (1.18.4-1) ...
188s Selecting previously unselected package libjs-jquery.
188s Preparing to unpack .../16-libjs-jquery_3.6.1+dfsg+~3.5.14-1_all.deb ...
188s Unpacking libjs-jquery (3.6.1+dfsg+~3.5.14-1) ...
188s Selecting previously unselected package libjs-underscore.
188s Preparing to unpack .../17-libjs-underscore_1.13.4~dfsg+~1.11.4-3_all.deb ...
188s Unpacking libjs-underscore (1.13.4~dfsg+~1.11.4-3) ...
188s Selecting previously unselected package libjs-sphinxdoc.
188s Preparing to unpack .../18-libjs-sphinxdoc_8.2.3-1_all.deb ...
188s Unpacking libjs-sphinxdoc (8.2.3-1) ...
188s Selecting previously unselected package python-kombu-doc.
189s Preparing to unpack .../19-python-kombu-doc_5.4.2-3_all.deb ...
189s Unpacking python-kombu-doc (5.4.2-3) ...
189s Selecting previously unselected package python3-adal.
189s Preparing to unpack .../20-python3-adal_1.2.7-5_all.deb ...
189s Unpacking python3-adal (1.2.7-5) ...
189s Selecting previously unselected package python3-aiohappyeyeballs.
189s Preparing to unpack .../21-python3-aiohappyeyeballs_2.6.1-1_all.deb ...
189s Unpacking python3-aiohappyeyeballs (2.6.1-1) ...
189s Selecting previously unselected package python3-multidict.
189s Preparing to unpack .../22-python3-multidict_6.4.3-1_s390x.deb ...
189s Unpacking python3-multidict (6.4.3-1) ...
189s Selecting previously unselected package python3-yarl.
189s Preparing to unpack .../23-python3-yarl_1.13.1-1build2_s390x.deb ...
189s Unpacking python3-yarl (1.13.1-1build2) ...
189s Selecting previously unselected package python3-async-timeout.
189s Preparing to unpack .../24-python3-async-timeout_5.0.1-1_all.deb ...
189s Unpacking python3-async-timeout (5.0.1-1) ...
189s Selecting previously unselected package python3-frozenlist.
189s Preparing to unpack .../25-python3-frozenlist_1.5.0-1build2_s390x.deb ...
189s Unpacking python3-frozenlist (1.5.0-1build2) ...
190s Selecting previously unselected package python3-aiosignal.
190s Preparing to unpack .../26-python3-aiosignal_1.3.2-1_all.deb ...
190s Unpacking python3-aiosignal (1.3.2-1) ...
190s Selecting previously unselected package python3-aiohttp.
190s Preparing to unpack .../27-python3-aiohttp_3.10.11-1build1_s390x.deb ...
190s Unpacking python3-aiohttp (3.10.11-1build1) ...
190s Selecting previously unselected package python3-all.
190s Preparing to unpack .../28-python3-all_3.13.3-1_s390x.deb ...
190s Unpacking python3-all (3.13.3-1) ...
190s Selecting previously unselected package python3-avro.
190s Preparing to unpack .../29-python3-avro_1.12.0+dfsg-1_all.deb ...
190s Unpacking python3-avro (1.12.0+dfsg-1) ...
190s Selecting previously unselected package python3-isodate.
190s Preparing to unpack .../30-python3-isodate_0.7.0-1_all.deb ...
190s Unpacking python3-isodate (0.7.0-1) ...
190s Selecting previously unselected package python3-requests-oauthlib.
190s Preparing to unpack .../31-python3-requests-oauthlib_1.3.1-1_all.deb ...
190s Unpacking python3-requests-oauthlib (1.3.1-1) ...
190s Selecting previously unselected package python3-msrest.
190s Preparing to unpack .../32-python3-msrest_0.6.21-5_all.deb ...
190s Unpacking python3-msrest (0.6.21-5) ...
190s Selecting previously unselected package python3-msrestazure.
190s Preparing to unpack .../33-python3-msrestazure_0.6.4-4_all.deb ...
190s Unpacking python3-msrestazure (0.6.4-4) ...
190s Selecting previously unselected package python3-azure-storage.
190s Preparing to unpack .../34-python3-azure-storage_20250304+git-1_all.deb ...
190s Unpacking python3-azure-storage (20250304+git-1) ...
191s Selecting previously unselected package python3-colorama.
191s Preparing to unpack .../35-python3-colorama_0.4.6-4_all.deb ...
191s Unpacking python3-colorama (0.4.6-4) ...
191s Selecting previously unselected package python3-dnspython.
191s Preparing to unpack .../36-python3-dnspython_2.7.0-1ubuntu1_all.deb ...
191s Unpacking python3-dnspython (2.7.0-1ubuntu1) ...
191s Selecting previously unselected package python3-marshmallow.
192s Preparing to unpack .../37-python3-marshmallow_3.26.1-0.2_all.deb ...
192s Unpacking python3-marshmallow (3.26.1-0.2) ...
192s Selecting previously unselected package python3-msal.
192s Preparing to unpack .../38-python3-msal_1.32.3-1_all.deb ...
192s Unpacking python3-msal (1.32.3-1) ...
192s Selecting previously unselected package python3-cairo.
192s Preparing to unpack .../39-python3-cairo_1.27.0-2_s390x.deb ...
192s Unpacking python3-cairo (1.27.0-2) ...
192s Selecting previously unselected package python3-gi-cairo.
192s Preparing to unpack .../40-python3-gi-cairo_3.50.0-4build1_s390x.deb ...
192s Unpacking python3-gi-cairo (3.50.0-4build1) ...
192s Selecting previously unselected package python3-portalocker.
192s Preparing to unpack .../41-python3-portalocker_3.1.1-1_all.deb ...
192s Unpacking python3-portalocker (3.1.1-1) ...
192s Selecting previously unselected package python3-msal-extensions.
192s Preparing to unpack .../42-python3-msal-extensions_1.3.1-1_all.deb ...
192s Unpacking python3-msal-extensions (1.3.1-1) ...
192s Selecting previously unselected package python3-click.
192s Preparing to unpack .../43-python3-click_8.2.0+0.really.8.1.8-1_all.deb ...
192s Unpacking python3-click (8.2.0+0.really.8.1.8-1) ...
192s Selecting previously unselected package python3-joblib.
192s Preparing to unpack .../44-python3-joblib_1.4.2-3_all.deb ...
192s Unpacking python3-joblib (1.4.2-3) ...
192s Selecting previously unselected package python3-regex.
192s Preparing to unpack .../45-python3-regex_0.1.20241106-1build1_s390x.deb ...
192s Unpacking python3-regex (0.1.20241106-1build1) ...
193s Selecting previously unselected package python3-tqdm.
193s Preparing to unpack .../46-python3-tqdm_4.67.1-3_all.deb ...
193s Unpacking python3-tqdm (4.67.1-3) ...
193s Selecting previously unselected package python3-nltk.
193s Preparing to unpack .../47-python3-nltk_3.9.1-2_all.deb ...
193s Unpacking python3-nltk (3.9.1-2) ...
193s Selecting previously unselected package python3-psutil.
193s Preparing to unpack .../48-python3-psutil_5.9.8-2build3_s390x.deb ...
193s Unpacking python3-psutil (5.9.8-2build3) ...
194s Selecting previously unselected package python3-pydash.
194s Preparing to unpack .../49-python3-pydash_8.0.5-1_all.deb ...
194s Unpacking python3-pydash (8.0.5-1) ...
194s Selecting previously unselected package python3-ruamel.yaml.clib.
194s Preparing to unpack .../50-python3-ruamel.yaml.clib_0.2.12+ds-1build1_s390x.deb ...
194s Unpacking python3-ruamel.yaml.clib (0.2.12+ds-1build1) ...
194s Selecting previously unselected package python3-ruamel.yaml.
194s Preparing to unpack .../51-python3-ruamel.yaml_0.18.10+ds-1_all.deb ...
194s Unpacking python3-ruamel.yaml (0.18.10+ds-1) ...
194s Selecting previously unselected package python3-strictyaml.
194s Preparing to unpack .../52-python3-strictyaml_1.6.1-3_all.deb ...
194s Unpacking python3-strictyaml (1.6.1-3) ...
194s Selecting previously unselected package python3-websocket.
194s Preparing to unpack .../53-python3-websocket_1.8.0-2_all.deb ...
194s Unpacking python3-websocket (1.8.0-2) ...
195s Selecting previously unselected package python3-azure.
195s Preparing to unpack .../54-python3-azure_20250304+git-1_all.deb ...
195s Unpacking python3-azure (20250304+git-1) ...
228s Selecting previously unselected package python3-bson.
228s Preparing to unpack .../55-python3-bson_4.10.1-5build1_all.deb ...
228s Unpacking python3-bson (4.10.1-5build1) ...
229s Selecting previously unselected package python3-sortedcontainers.
229s Preparing to unpack .../56-python3-sortedcontainers_2.4.0-2_all.deb ...
229s Unpacking python3-sortedcontainers (2.4.0-2) ...
229s Selecting previously unselected package python3-hypothesis.
229s Preparing to unpack .../57-python3-hypothesis_6.130.5-1_all.deb ...
229s Unpacking python3-hypothesis (6.130.5-1) ...
230s Selecting previously unselected package python3-iniconfig.
230s Preparing to unpack .../58-python3-iniconfig_1.1.1-2_all.deb ...
230s Unpacking python3-iniconfig (1.1.1-2) ...
230s Selecting previously unselected package python3-vine.
230s Preparing to unpack .../59-python3-vine_5.1.0+dfsg-1_all.deb ...
230s Unpacking python3-vine (5.1.0+dfsg-1) ...
230s Selecting previously unselected package python3-amqp.
230s Preparing to unpack .../60-python3-amqp_5.3.1-2_all.deb ...
230s Unpacking python3-amqp (5.3.1-2) ...
230s Selecting previously unselected package python3-kombu.
231s Preparing to unpack .../61-python3-kombu_5.4.2-3_all.deb ...
231s Unpacking python3-kombu (5.4.2-3) ...
231s Selecting previously unselected package python3-msgpack.
231s Preparing to unpack .../62-python3-msgpack_1.0.3-3build4_s390x.deb ...
231s Unpacking python3-msgpack (1.0.3-3build4) ...
231s Selecting previously unselected package python3-pluggy.
231s Preparing to unpack .../63-python3-pluggy_1.5.0-1_all.deb ...
231s Unpacking python3-pluggy (1.5.0-1) ...
231s Selecting previously unselected package python3-pymongo.
231s Preparing to unpack .../64-python3-pymongo_4.10.1-5build1_all.deb ...
231s Unpacking python3-pymongo (4.10.1-5build1) ...
231s Selecting previously unselected package python3-pytest.
231s Preparing to unpack .../65-python3-pytest_8.3.5-1_all.deb ...
231s Unpacking python3-pytest (8.3.5-1) ...
232s Selecting previously unselected package python3-pytz.
232s Preparing to unpack .../66-python3-pytz_2025.1-3_all.deb ...
232s Unpacking python3-pytz (2025.1-3) ...
232s Selecting previously unselected package python3-redis.
232s Preparing to unpack .../67-python3-redis_5.2.1-1_all.deb ...
232s Unpacking python3-redis (5.2.1-1) ...
233s Selecting previously unselected package python3-greenlet.
233s Preparing to unpack .../68-python3-greenlet_3.1.0-1build1_s390x.deb ...
233s Unpacking python3-greenlet (3.1.0-1build1) ...
233s Selecting previously unselected package python3-sqlalchemy.
233s Preparing to unpack .../69-python3-sqlalchemy_2.0.38+ds1-0ubuntu2_all.deb ...
233s Unpacking python3-sqlalchemy (2.0.38+ds1-0ubuntu2) ...
233s Selecting previously unselected package python3-tz.
233s Preparing to unpack .../70-python3-tz_2025.1-3_all.deb ...
233s Unpacking python3-tz (2025.1-3) ...
234s Setting up python3-iniconfig (1.1.1-2) ...
234s Setting up libpixman-1-0:s390x (0.44.0-3) ...
234s Setting up libxrender1:s390x (1:0.9.12-1) ...
234s Setting up python3-joblib (1.4.2-3) ...
237s Setting up python3-colorama (0.4.6-4) ...
238s Setting up libxcb-render0:s390x (1.17.0-2) ...
238s Setting up python3-tqdm (4.67.1-3) ...
238s Setting up python3-ruamel.yaml.clib (0.2.12+ds-1build1) ...
238s Setting up python3-marshmallow (3.26.1-0.2) ...
239s Setting up python3-msal (1.32.3-1) ...
240s Setting up python3-all (3.13.3-1) ...
240s Setting up python3-pytz (2025.1-3) ...
241s Setting up libxcb-shm0:s390x (1.17.0-2) ...
241s Setting up python3-sortedcontainers (2.4.0-2) ...
241s Setting up python3-click (8.2.0+0.really.8.1.8-1) ...
242s Setting up python3-psutil (5.9.8-2build3) ...
244s Setting up python3-multidict (6.4.3-1) ...
245s Setting up python3-tz (2025.1-3) ...
245s Setting up python3-vine (5.1.0+dfsg-1) ...
245s Setting up python3-frozenlist (1.5.0-1build2) ...
246s Setting up python3-aiosignal (1.3.2-1) ...
247s Setting up python3-async-timeout (5.0.1-1) ...
248s Setting up python3-bson (4.10.1-5build1) ...
248s Setting up python3-isodate (0.7.0-1) ...
250s Setting up libfreetype6:s390x (2.13.3+dfsg-1) ...
250s Setting up python3-avro (1.12.0+dfsg-1) ...
251s Setting up python3-greenlet (3.1.0-1build1) ...
252s Setting up fonts-dejavu-mono (2.37-8) ...
252s Setting up fonts-dejavu-core (2.37-8) ...
252s Setting up python3-redis (5.2.1-1) ...
253s Setting up python3-aiohappyeyeballs (2.6.1-1) ...
254s Setting up python3-regex (0.1.20241106-1build1) ...
255s Setting up python3-pluggy (1.5.0-1) ...
256s Setting up python3-ruamel.yaml (0.18.10+ds-1) ...
257s Setting up python3-adal (1.2.7-5) ...
259s Setting up python3-dnspython (2.7.0-1ubuntu1) ...
260s Setting up python3-portalocker (3.1.1-1) ...
261s Setting up python3-amqp (5.3.1-2) ...
262s Setting up python3-msgpack (1.0.3-3build4) ...
263s Setting up libjs-jquery (3.6.1+dfsg+~3.5.14-1) ...
263s Setting up python3-serpent (1.41-2) ...
264s Setting up python3-pymongo (4.10.1-5build1) ...
266s Setting up python3-pydash (8.0.5-1) ...
267s Setting up python3-nltk (3.9.1-2) ...
273s Setting up python3-yarl (1.13.1-1build2) ...
274s Setting up python3-websocket (1.8.0-2) ...
275s Setting up libsecret-common (0.21.7-1) ...
275s Setting up python3-requests-oauthlib (1.3.1-1) ...
275s Setting up libjs-underscore (1.13.4~dfsg+~1.11.4-3) ...
275s Setting up fontconfig-config (2.15.0-2.2ubuntu1) ...
277s Setting up python3-pytest (8.3.5-1) ...
278s Setting up python3-hypothesis (6.130.5-1) ...
280s Setting up python3-aiohttp (3.10.11-1build1) ...
282s Setting up python3-kombu (5.4.2-3) ...
284s Setting up python3-sqlalchemy (2.0.38+ds1-0ubuntu2) ...
293s Setting up python3-msrest (0.6.21-5) ...
294s Setting up python3-strictyaml (1.6.1-3) ...
296s Setting up libsecret-1-0:s390x (0.21.7-1) ...
296s Setting up gir1.2-secret-1:s390x (0.21.7-1) ...
296s Setting up libjs-sphinxdoc (8.2.3-1) ...
296s Setting up python3-pyro5 (5.15-1ubuntu1) ...
299s Setting up libfontconfig1:s390x (2.15.0-2.2ubuntu1) ...
299s Setting up python3-msrestazure (0.6.4-4) ...
300s Setting up python-kombu-doc (5.4.2-3) ...
300s Setting up libcairo2:s390x (1.18.4-1) ...
300s Setting up libcairo-gobject2:s390x (1.18.4-1) ...
300s Setting up python3-cairo (1.27.0-2) ...
301s Setting up python3-gi-cairo (3.50.0-4build1) ...
301s Setting up python3-msal-extensions (1.3.1-1) ...
302s Setting up python3-azure-storage (20250304+git-1) ...
308s Setting up python3-azure (20250304+git-1) ...
388s /usr/lib/python3/dist-packages/azure/ai/ml/_vendor/azure_resources/aio/operations/_resources_operations.py:80: SyntaxWarning: invalid escape sequence '\ '
388s Valid values include ``createdTime``\ , ``changedTime`` and ``provisioningState``. For example,
388s /usr/lib/python3/dist-packages/azure/ai/ml/_vendor/azure_resources/aio/operations/_resources_operations.py:405: SyntaxWarning: invalid escape sequence '\ '
388s Valid values include ``createdTime``\ , ``changedTime`` and ``provisioningState``. For example,
400s /usr/lib/python3/dist-packages/azure/appconfiguration/_generated/models/_models.py:238: SyntaxWarning: invalid escape sequence '\ '
400s """An error, available when the status is ``Failed``\ , describing why the operation
403s /usr/lib/python3/dist-packages/azure/batch/models/_models.py:9067: SyntaxWarning: invalid escape sequence '\ '
403s """The source port ranges to match for the rule. Valid values are '\ *' (for all ports 0 - 65535),
403s /usr/lib/python3/dist-packages/azure/batch/models/_models.py:9235: SyntaxWarning: invalid escape sequence '\ '
403s using brackets (for example abc[\ *] would match a file named abc*\ ). Note that both and / are
408s /usr/lib/python3/dist-packages/azure/communication/jobrouter/models/_models.py:2326: SyntaxWarning: invalid escape sequence '\ '
408s payload to scoring rule. If not set, a job's labels (sent in the payload as ``job``\ ) and a
408s /usr/lib/python3/dist-packages/azure/communication/jobrouter/models/_models.py:2346: SyntaxWarning: invalid escape sequence '\ '
408s If not set, a job's labels (sent in the payload as ``job``\ ) and a job's worker selectors
426s /usr/lib/python3/dist-packages/azure/mgmt/advisor/aio/operations/_recommendations_operations.py:190: SyntaxWarning: invalid escape sequence '\ '
426s properties ['ResourceId', 'ResourceGroup', 'RecommendationTypeGuid', '\ `Category
426s /usr/lib/python3/dist-packages/azure/mgmt/advisor/operations/_recommendations_operations.py:303: SyntaxWarning: invalid escape sequence '\ '
426s properties ['ResourceId', 'ResourceGroup', 'RecommendationTypeGuid', '\ `Category
430s /usr/lib/python3/dist-packages/azure/mgmt/apimanagement/models/_models_py3.py:3917: SyntaxWarning: invalid escape sequence '\ '
430s Possible Values::code:`
`:code:`
` **Standard**\ :code:`
`:code:`
`
430s /usr/lib/python3/dist-packages/azure/mgmt/apimanagement/models/_models_py3.py:10212: SyntaxWarning: invalid escape sequence '\ '
430s ``aad://.onmicrosoft.com/groups/``\ ; otherwise the value is null.
430s /usr/lib/python3/dist-packages/azure/mgmt/apimanagement/models/_models_py3.py:10255: SyntaxWarning: invalid escape sequence '\ '
430s ``aad://.onmicrosoft.com/groups/``\ ; otherwise the value is null.
430s /usr/lib/python3/dist-packages/azure/mgmt/apimanagement/models/_models_py3.py:10284: SyntaxWarning: invalid escape sequence '\ '
430s ``aad://.onmicrosoft.com/groups/``\ ; otherwise the value is null.
430s /usr/lib/python3/dist-packages/azure/mgmt/apimanagement/models/_models_py3.py:10320: SyntaxWarning: invalid escape sequence '\ '
430s ``aad://.onmicrosoft.com/groups/``\ ; otherwise the value is null.
430s /usr/lib/python3/dist-packages/azure/mgmt/apimanagement/models/_models_py3.py:10342: SyntaxWarning: invalid escape sequence '\ '
430s ``aad://.onmicrosoft.com/groups/``\ ; otherwise the value is null.
430s /usr/lib/python3/dist-packages/azure/mgmt/apimanagement/models/_models_py3.py:10375: SyntaxWarning: invalid escape sequence '\ '
430s ``aad://.onmicrosoft.com/groups/``\ ; otherwise the value is null.
430s /usr/lib/python3/dist-packages/azure/mgmt/apimanagement/models/_models_py3.py:10396: SyntaxWarning: invalid escape sequence '\ '
430s ``aad://.onmicrosoft.com/groups/``\ ; otherwise the value is null.
430s /usr/lib/python3/dist-packages/azure/mgmt/apimanagement/models/_models_py3.py:10429: SyntaxWarning: invalid escape sequence '\ '
430s ``aad://.onmicrosoft.com/groups/``\ ; otherwise the value is null.
430s /usr/lib/python3/dist-packages/azure/mgmt/apimanagement/models/_models_py3.py:14746: SyntaxWarning: invalid escape sequence '\ '
430s :ivar allowed_sources: Allowed sources, e.g. ``*.trusted.com``\ , ``trusted.com``\ ,
430s /usr/lib/python3/dist-packages/azure/mgmt/apimanagement/models/_models_py3.py:14771: SyntaxWarning: invalid escape sequence '\ '
430s :keyword allowed_sources: Allowed sources, e.g. ``*.trusted.com``\ , ``trusted.com``\ ,
453s /usr/lib/python3/dist-packages/azure/mgmt/batchai/models/_models.py:1420: SyntaxWarning: invalid escape sequence '\ '
453s :param id: Required. The ID for the input directory. The job can use AZ_BATCHAI\ *INPUT*\
453s /usr/lib/python3/dist-packages/azure/mgmt/batchai/models/_models.py:2310: SyntaxWarning: invalid escape sequence '\ '
453s :param id: Required. The ID of the output directory. The job can use AZ_BATCHAI\ *OUTPUT*\
453s /usr/lib/python3/dist-packages/azure/mgmt/batchai/models/_models_py3.py:1547: SyntaxWarning: invalid escape sequence '\ '
453s :param id: Required. The ID for the input directory. The job can use AZ_BATCHAI\ *INPUT*\
453s /usr/lib/python3/dist-packages/azure/mgmt/batchai/models/_models_py3.py:2524: SyntaxWarning: invalid escape sequence '\ '
453s :param id: Required. The ID of the output directory. The job can use AZ_BATCHAI\ *OUTPUT*\
477s /usr/lib/python3/dist-packages/azure/mgmt/computefleet/models/_models.py:624: SyntaxWarning: invalid escape sequence '\ '
477s and Screenshot to diagnose VM status. **NOTE**\ : If storageUri is being
477s /usr/lib/python3/dist-packages/azure/mgmt/computefleet/models/_models.py:3707: SyntaxWarning: invalid escape sequence '\W'
477s characters :code:`
` Has a digit :code:`
` Has a special character (Regex match [\W_])
501s /usr/lib/python3/dist-packages/azure/mgmt/datamigration/models/_models_py3.py:16843: SyntaxWarning: invalid escape sequence '\S'
501s Protocol:MachineName\SQLServerInstanceName,PortNumber. Required.
501s /usr/lib/python3/dist-packages/azure/mgmt/datamigration/models/_models_py3.py:16916: SyntaxWarning: invalid escape sequence '\S'
501s Protocol:MachineName\SQLServerInstanceName,PortNumber. Required.
514s /usr/lib/python3/dist-packages/azure/mgmt/documentdb/operations/database_accounts_operations.py:63: SyntaxWarning: invalid escape sequence '\w'
514s 'resourceGroupName': self._serialize.url("resource_group_name", resource_group_name, 'str', max_length=90, min_length=1, pattern='^[-\w\._\(\)]+$'),
514s /usr/lib/python3/dist-packages/azure/mgmt/documentdb/operations/database_accounts_operations.py:130: SyntaxWarning: invalid escape sequence '\w'
514s 'resourceGroupName': self._serialize.url("resource_group_name", resource_group_name, 'str', max_length=90, min_length=1, pattern='^[-\w\._\(\)]+$'),
514s /usr/lib/python3/dist-packages/azure/mgmt/documentdb/operations/database_accounts_operations.py:224: SyntaxWarning: invalid escape sequence '\w'
514s 'resourceGroupName': self._serialize.url("resource_group_name", resource_group_name, 'str', max_length=90, min_length=1, pattern='^[-\w\._\(\)]+$'),
514s /usr/lib/python3/dist-packages/azure/mgmt/documentdb/operations/database_accounts_operations.py:312: SyntaxWarning: invalid escape sequence '\w'
514s 'resourceGroupName': self._serialize.url("resource_group_name", resource_group_name, 'str', max_length=90, min_length=1, pattern='^[-\w\._\(\)]+$'),
514s /usr/lib/python3/dist-packages/azure/mgmt/documentdb/operations/database_accounts_operations.py:398: SyntaxWarning: invalid escape sequence '\w'
514s 'resourceGroupName': self._serialize.url("resource_group_name", resource_group_name, 'str', max_length=90, min_length=1, pattern='^[-\w\._\(\)]+$'),
514s /usr/lib/python3/dist-packages/azure/mgmt/documentdb/operations/database_accounts_operations.py:543: SyntaxWarning: invalid escape sequence '\w'
514s 'resourceGroupName': self._serialize.url("resource_group_name", resource_group_name, 'str', max_length=90, min_length=1, pattern='^[-\w\._\(\)]+$'),
514s /usr/lib/python3/dist-packages/azure/mgmt/documentdb/operations/database_accounts_operations.py:612: SyntaxWarning: invalid escape sequence '\w'
514s 'resourceGroupName': self._serialize.url("resource_group_name", resource_group_name, 'str', max_length=90, min_length=1, pattern='^[-\w\._\(\)]+$'),
514s /usr/lib/python3/dist-packages/azure/mgmt/documentdb/operations/database_accounts_operations.py:675: SyntaxWarning: invalid escape sequence '\w'
514s 'resourceGroupName': self._serialize.url("resource_group_name", resource_group_name, 'str', max_length=90, min_length=1, pattern='^[-\w\._\(\)]+$'),
514s /usr/lib/python3/dist-packages/azure/mgmt/documentdb/operations/database_accounts_operations.py:738: SyntaxWarning: invalid escape sequence '\w'
514s 'resourceGroupName': self._serialize.url("resource_group_name", resource_group_name, 'str', max_length=90, min_length=1, pattern='^[-\w\._\(\)]+$'),
514s /usr/lib/python3/dist-packages/azure/mgmt/documentdb/operations/database_accounts_operations.py:807: SyntaxWarning: invalid escape sequence '\w'
514s 'resourceGroupName': self._serialize.url("resource_group_name", resource_group_name, 'str', max_length=90, min_length=1, pattern='^[-\w\._\(\)]+$'),
530s /usr/lib/python3/dist-packages/azure/mgmt/hybridnetwork/models/_models_py3.py:6032: SyntaxWarning: invalid escape sequence '\ '
530s :ivar provisioning_state: The provisioning state of the site resource. **TODO**\ : Confirm if
540s /usr/lib/python3/dist-packages/azure/mgmt/iotoperations/models/_models.py:3866: SyntaxWarning: invalid escape sequence '\ '
540s pattern set glob-style pattern (e.g., '\ *', 'clients/*\ '). Required."""
540s /usr/lib/python3/dist-packages/azure/mgmt/iotoperations/models/_models.py:3868: SyntaxWarning: invalid escape sequence '\ '
540s """Give access for ``Read``\ , ``Write`` and ``ReadWrite`` access level. Required. Known values
554s /usr/lib/python3/dist-packages/azure/mgmt/machinelearningservices/models/_machine_learning_services_mgmt_client_enums.py:169: SyntaxWarning: invalid escape sequence '\ '
554s #: The "forest"\ it builds, is an ensemble of decision trees, usually trained with the “bagging”\
554s /usr/lib/python3/dist-packages/azure/mgmt/machinelearningservices/models/_machine_learning_services_mgmt_client_enums.py:1032: SyntaxWarning: invalid escape sequence '\ '
554s #: The "forest"\ it builds, is an ensemble of decision trees, usually trained with the “bagging”\
589s /usr/lib/python3/dist-packages/azure/mgmt/recoveryservicessiterecovery/aio/operations/_replication_protected_items_operations.py:2542: SyntaxWarning: invalid escape sequence '\R'
589s """Execute Reverse Replication\Reprotect.
589s /usr/lib/python3/dist-packages/azure/mgmt/recoveryservicessiterecovery/aio/operations/_replication_protected_items_operations.py:2583: SyntaxWarning: invalid escape sequence '\R'
589s """Execute Reverse Replication\Reprotect.
589s /usr/lib/python3/dist-packages/azure/mgmt/recoveryservicessiterecovery/aio/operations/_replication_protected_items_operations.py:2622: SyntaxWarning: invalid escape sequence '\R'
589s """Execute Reverse Replication\Reprotect.
590s /usr/lib/python3/dist-packages/azure/mgmt/recoveryservicessiterecovery/models/_models_py3.py:5397: SyntaxWarning: invalid escape sequence '\L'
590s :ivar lun_id: Ordinal\LunId of the disk for the Azure VM.
590s /usr/lib/python3/dist-packages/azure/mgmt/recoveryservicessiterecovery/models/_models_py3.py:5448: SyntaxWarning: invalid escape sequence '\L'
590s :keyword lun_id: Ordinal\LunId of the disk for the Azure VM.
590s /usr/lib/python3/dist-packages/azure/mgmt/recoveryservicessiterecovery/models/_models_py3.py:8836: SyntaxWarning: invalid escape sequence '\S'
590s :ivar enable_rdp_on_target_option: The selected option to enable RDP\SSH on target vm after
590s /usr/lib/python3/dist-packages/azure/mgmt/recoveryservicessiterecovery/models/_models_py3.py:8978: SyntaxWarning: invalid escape sequence '\S'
590s :keyword enable_rdp_on_target_option: The selected option to enable RDP\SSH on target vm after
590s /usr/lib/python3/dist-packages/azure/mgmt/recoveryservicessiterecovery/models/_models_py3.py:9510: SyntaxWarning: invalid escape sequence '\S'
590s :ivar enable_rdp_on_target_option: The selected option to enable RDP\SSH on target vm after
590s /usr/lib/python3/dist-packages/azure/mgmt/recoveryservicessiterecovery/models/_models_py3.py:9675: SyntaxWarning: invalid escape sequence '\S'
590s :keyword enable_rdp_on_target_option: The selected option to enable RDP\SSH on target vm after
590s /usr/lib/python3/dist-packages/azure/mgmt/recoveryservicessiterecovery/models/_models_py3.py:11412: SyntaxWarning: invalid escape sequence '\S'
590s :ivar enable_rdp_on_target_option: The selected option to enable RDP\SSH on target VM after
590s /usr/lib/python3/dist-packages/azure/mgmt/recoveryservicessiterecovery/models/_models_py3.py:11541: SyntaxWarning: invalid escape sequence '\S'
590s :keyword enable_rdp_on_target_option: The selected option to enable RDP\SSH on target VM after
590s /usr/lib/python3/dist-packages/azure/mgmt/recoveryservicessiterecovery/models/_models_py3.py:12193: SyntaxWarning: invalid escape sequence '\S'
590s :ivar enable_rdp_on_target_option: The selected option to enable RDP\SSH on target vm after
590s /usr/lib/python3/dist-packages/azure/mgmt/recoveryservicessiterecovery/models/_models_py3.py:12516: SyntaxWarning: invalid escape sequence '\S'
590s :keyword enable_rdp_on_target_option: The selected option to enable RDP\SSH on target vm after
590s /usr/lib/python3/dist-packages/azure/mgmt/recoveryservicessiterecovery/models/_models_py3.py:26323: SyntaxWarning: invalid escape sequence '\S'
590s :ivar enable_rdp_on_target_option: The selected option to enable RDP\SSH on target vm after
590s /usr/lib/python3/dist-packages/azure/mgmt/recoveryservicessiterecovery/models/_models_py3.py:26382: SyntaxWarning: invalid escape sequence '\S'
590s :keyword enable_rdp_on_target_option: The selected option to enable RDP\SSH on target vm after
591s /usr/lib/python3/dist-packages/azure/mgmt/recoveryservicessiterecovery/operations/_replication_protected_items_operations.py:3476: SyntaxWarning: invalid escape sequence '\R'
591s """Execute Reverse Replication\Reprotect.
591s /usr/lib/python3/dist-packages/azure/mgmt/recoveryservicessiterecovery/operations/_replication_protected_items_operations.py:3517: SyntaxWarning: invalid escape sequence '\R'
591s """Execute Reverse Replication\Reprotect.
591s /usr/lib/python3/dist-packages/azure/mgmt/recoveryservicessiterecovery/operations/_replication_protected_items_operations.py:3556: SyntaxWarning: invalid escape sequence '\R'
591s """Execute Reverse Replication\Reprotect.
594s /usr/lib/python3/dist-packages/azure/mgmt/reservations/aio/operations/_azure_reservation_api_operations.py:163: SyntaxWarning: invalid escape sequence '\ '
594s """Get list of applicable ``Reservation``\ s.
594s /usr/lib/python3/dist-packages/azure/mgmt/reservations/aio/operations/_reservation_operations.py:377: SyntaxWarning: invalid escape sequence '\ '
594s Split a ``Reservation`` into two ``Reservation``\ s with specified quantity distribution.
594s /usr/lib/python3/dist-packages/azure/mgmt/reservations/aio/operations/_reservation_operations.py:407: SyntaxWarning: invalid escape sequence '\ '
594s Split a ``Reservation`` into two ``Reservation``\ s with specified quantity distribution.
594s /usr/lib/python3/dist-packages/azure/mgmt/reservations/aio/operations/_reservation_operations.py:437: SyntaxWarning: invalid escape sequence '\ '
594s Split a ``Reservation`` into two ``Reservation``\ s with specified quantity distribution.
594s /usr/lib/python3/dist-packages/azure/mgmt/reservations/aio/operations/_reservation_operations.py:583: SyntaxWarning: invalid escape sequence '\ '
594s """Merges two ``Reservation``\ s.
594s /usr/lib/python3/dist-packages/azure/mgmt/reservations/aio/operations/_reservation_operations.py:614: SyntaxWarning: invalid escape sequence '\ '
594s """Merges two ``Reservation``\ s.
594s /usr/lib/python3/dist-packages/azure/mgmt/reservations/aio/operations/_reservation_operations.py:645: SyntaxWarning: invalid escape sequence '\ '
594s """Merges two ``Reservation``\ s.
594s /usr/lib/python3/dist-packages/azure/mgmt/reservations/aio/operations/_reservation_operations.py:721: SyntaxWarning: invalid escape sequence '\ '
594s """Get ``Reservation``\ s in a given reservation Order.
594s /usr/lib/python3/dist-packages/azure/mgmt/reservations/aio/operations/_reservation_order_operations.py:183: SyntaxWarning: invalid escape sequence '\ '
594s """Get all ``ReservationOrder``\ s.
594s /usr/lib/python3/dist-packages/azure/mgmt/reservations/models/_models_py3.py:3172: SyntaxWarning: invalid escape sequence '\ '
594s """List of ``Reservation``\ s.
594s /usr/lib/python3/dist-packages/azure/mgmt/reservations/models/_models_py3.py:3288: SyntaxWarning: invalid escape sequence '\ '
594s """List of ``ReservationOrder``\ s.
594s /usr/lib/python3/dist-packages/azure/mgmt/reservations/operations/_azure_reservation_api_operations.py:239: SyntaxWarning: invalid escape sequence '\ '
594s """Get list of applicable ``Reservation``\ s.
594s /usr/lib/python3/dist-packages/azure/mgmt/reservations/operations/_reservation_operations.py:662: SyntaxWarning: invalid escape sequence '\ '
594s Split a ``Reservation`` into two ``Reservation``\ s with specified quantity distribution.
594s /usr/lib/python3/dist-packages/azure/mgmt/reservations/operations/_reservation_operations.py:692: SyntaxWarning: invalid escape sequence '\ '
594s Split a ``Reservation`` into two ``Reservation``\ s with specified quantity distribution.
594s /usr/lib/python3/dist-packages/azure/mgmt/reservations/operations/_reservation_operations.py:722: SyntaxWarning: invalid escape sequence '\ '
594s Split a ``Reservation`` into two ``Reservation``\ s with specified quantity distribution.
594s /usr/lib/python3/dist-packages/azure/mgmt/reservations/operations/_reservation_operations.py:868: SyntaxWarning: invalid escape sequence '\ '
594s """Merges two ``Reservation``\ s.
594s /usr/lib/python3/dist-packages/azure/mgmt/reservations/operations/_reservation_operations.py:899: SyntaxWarning: invalid escape sequence '\ '
594s """Merges two ``Reservation``\ s.
594s /usr/lib/python3/dist-packages/azure/mgmt/reservations/operations/_reservation_operations.py:930: SyntaxWarning: invalid escape sequence '\ '
594s """Merges two ``Reservation``\ s.
594s /usr/lib/python3/dist-packages/azure/mgmt/reservations/operations/_reservation_operations.py:1006: SyntaxWarning: invalid escape sequence '\ '
594s """Get ``Reservation``\ s in a given reservation Order.
594s /usr/lib/python3/dist-packages/azure/mgmt/reservations/operations/_reservation_order_operations.py:299: SyntaxWarning: invalid escape sequence '\ '
594s """Get all ``ReservationOrder``\ s.
616s /usr/lib/python3/dist-packages/azure/mgmt/resourcegraph/models/_models_py3.py:68: SyntaxWarning: invalid escape sequence '\ '
616s **\ ``start``\ **\ ``, end)``. Specifying a ``start`` that occurs chronologically after ``end``
616s /usr/lib/python3/dist-packages/azure/mgmt/resourcegraph/models/_models_py3.py:90: SyntaxWarning: invalid escape sequence '\ '
616s ``[``\ **\ ``start``\ **\ ``, end)``. Specifying a ``start`` that occurs chronologically after
616s /usr/lib/python3/dist-packages/azure/mgmt/resourcegraph/models/_models_py3.py:1141: SyntaxWarning: invalid escape sequence '\ '
616s **\ ``start``\ **\ ``, end)``. Specifying a ``start`` that occurs chronologically after ``end``
616s /usr/lib/python3/dist-packages/azure/mgmt/resourcegraph/models/_models_py3.py:1163: SyntaxWarning: invalid escape sequence '\ '
616s ``[``\ **\ ``start``\ **\ ``, end)``. Specifying a ``start`` that occurs chronologically after
634s /usr/lib/python3/dist-packages/azure/mgmt/signalr/models/_models_py3.py:2858: SyntaxWarning: invalid escape sequence '\ '
634s For example, if the urlTemplate is ``http://example.com/{hub}/api/{event}``\ , with a client
634s /usr/lib/python3/dist-packages/azure/mgmt/signalr/models/_models_py3.py:2925: SyntaxWarning: invalid escape sequence '\ '
634s For example, if the urlTemplate is ``http://example.com/{hub}/api/{event}``\ , with a client
646s /usr/lib/python3/dist-packages/azure/mgmt/streamanalytics/aio/operations/_functions_operations.py:595: SyntaxWarning: invalid escape sequence '\ '
646s properties to include in the response, or "\ *" to include all properties. By default, all
646s /usr/lib/python3/dist-packages/azure/mgmt/streamanalytics/aio/operations/_inputs_operations.py:593: SyntaxWarning: invalid escape sequence '\ '
646s properties to include in the response, or "\ *" to include all properties. By default, all
646s /usr/lib/python3/dist-packages/azure/mgmt/streamanalytics/aio/operations/_outputs_operations.py:593: SyntaxWarning: invalid escape sequence '\ '
646s properties to include in the response, or "\ *" to include all properties. By default, all
646s /usr/lib/python3/dist-packages/azure/mgmt/streamanalytics/models/_stream_analytics_management_client_enums.py:14: SyntaxWarning: invalid escape sequence '\ '
646s """Authentication Mode. Valid modes are ``ConnectionString``\ , ``Msi`` and 'UserToken'."""
646s /usr/lib/python3/dist-packages/azure/mgmt/streamanalytics/operations/_functions_operations.py:859: SyntaxWarning: invalid escape sequence '\ '
646s properties to include in the response, or "\ *" to include all properties. By default, all
646s /usr/lib/python3/dist-packages/azure/mgmt/streamanalytics/operations/_inputs_operations.py:821: SyntaxWarning: invalid escape sequence '\ '
646s properties to include in the response, or "\ *" to include all properties. By default, all
646s /usr/lib/python3/dist-packages/azure/mgmt/streamanalytics/operations/_outputs_operations.py:821: SyntaxWarning: invalid escape sequence '\ '
646s properties to include in the response, or "\ *" to include all properties. By default, all
647s /usr/lib/python3/dist-packages/azure/mgmt/support/aio/operations/_communications_no_subscription_operations.py:193: SyntaxWarning: invalid escape sequence '\ '
647s a paged result with *nextLink*\ , using which you can retrieve the next set of Communication
647s /usr/lib/python3/dist-packages/azure/mgmt/support/aio/operations/_communications_operations.py:194: SyntaxWarning: invalid escape sequence '\ '
647s a paged result with *nextLink*\ , using which you can retrieve the next set of Communication
647s /usr/lib/python3/dist-packages/azure/mgmt/support/aio/operations/_support_tickets_operations.py:177: SyntaxWarning: invalid escape sequence '\ '
647s tickets by *Status*\ , *CreatedDate*\ , *ServiceId*\ , and *ProblemClassificationId* using the
647s /usr/lib/python3/dist-packages/azure/mgmt/support/aio/operations/_support_tickets_operations.py:540: SyntaxWarning: invalid escape sequence '\ '
647s information from your Azure resources.:code:`
`:code:`
`\ **Creating a support ticket
647s /usr/lib/python3/dist-packages/azure/mgmt/support/aio/operations/_support_tickets_operations.py:582: SyntaxWarning: invalid escape sequence '\ '
647s information from your Azure resources.:code:`
`:code:`
`\ **Creating a support ticket
647s /usr/lib/python3/dist-packages/azure/mgmt/support/aio/operations/_support_tickets_operations.py:622: SyntaxWarning: invalid escape sequence '\ '
647s information from your Azure resources.:code:`
`:code:`
`\ **Creating a support ticket
648s /usr/lib/python3/dist-packages/azure/mgmt/support/operations/_communications_no_subscription_operations.py:308: SyntaxWarning: invalid escape sequence '\ '
648s a paged result with *nextLink*\ , using which you can retrieve the next set of Communication
648s /usr/lib/python3/dist-packages/azure/mgmt/support/operations/_communications_operations.py:326: SyntaxWarning: invalid escape sequence '\ '
648s a paged result with *nextLink*\ , using which you can retrieve the next set of Communication
648s /usr/lib/python3/dist-packages/azure/mgmt/support/operations/_support_tickets_operations.py:319: SyntaxWarning: invalid escape sequence '\ '
648s tickets by *Status*\ , *CreatedDate*\ , *ServiceId*\ , and *ProblemClassificationId* using the
648s /usr/lib/python3/dist-packages/azure/mgmt/support/operations/_support_tickets_operations.py:681: SyntaxWarning: invalid escape sequence '\ '
648s information from your Azure resources.:code:`
`:code:`
`\ **Creating a support ticket
648s /usr/lib/python3/dist-packages/azure/mgmt/support/operations/_support_tickets_operations.py:723: SyntaxWarning: invalid escape sequence '\ '
648s information from your Azure resources.:code:`
`:code:`
`\ **Creating a support ticket
648s /usr/lib/python3/dist-packages/azure/mgmt/support/operations/_support_tickets_operations.py:763: SyntaxWarning: invalid escape sequence '\ '
648s information from your Azure resources.:code:`
`:code:`
`\ **Creating a support ticket
649s /usr/lib/python3/dist-packages/azure/mgmt/synapse/models/_models_py3.py:6232: SyntaxWarning: invalid escape sequence '\ '
649s :ivar maintenance_window_cycles: Available maintenance cycles e.g. {Saturday, 0, 48\ *60},
649s /usr/lib/python3/dist-packages/azure/mgmt/synapse/models/_models_py3.py:6288: SyntaxWarning: invalid escape sequence '\ '
649s :keyword maintenance_window_cycles: Available maintenance cycles e.g. {Saturday, 0, 48\ *60},
683s /usr/lib/python3/dist-packages/azure/mgmt/workloads/models/_models_py3.py:2909: SyntaxWarning: invalid escape sequence '\W'
683s digit :code:`
` Has a special character (Regex match [\W_]) :code:`
`:code:`
`
683s /usr/lib/python3/dist-packages/azure/mgmt/workloads/models/_models_py3.py:2954: SyntaxWarning: invalid escape sequence '\W'
683s digit :code:`
` Has a special character (Regex match [\W_]) :code:`
`:code:`
`
684s /usr/lib/python3/dist-packages/azure/mgmt/workloadssapvirtualinstance/models/_models_py3.py:1980: SyntaxWarning: invalid escape sequence '\W'
684s digit :code:`
` Has a special character (Regex match [\W_]) :code:`
`:code:`
`
684s /usr/lib/python3/dist-packages/azure/mgmt/workloadssapvirtualinstance/models/_models_py3.py:2025: SyntaxWarning: invalid escape sequence '\W'
684s digit :code:`
` Has a special character (Regex match [\W_]) :code:`
`:code:`
`
686s /usr/lib/python3/dist-packages/azure/purview/catalog/aio/operations/_operations.py:2732: SyntaxWarning: invalid escape sequence '\:'
686s attr:\:code:``=:code:``.
686s /usr/lib/python3/dist-packages/azure/purview/catalog/aio/operations/_operations.py:3537: SyntaxWarning: invalid escape sequence '\:'
686s attr:\:code:``=\:code:``.
686s /usr/lib/python3/dist-packages/azure/purview/catalog/aio/operations/_operations.py:4216: SyntaxWarning: invalid escape sequence '\:'
686s typeName=\:code:``&attr_1:\:code:``=\:code:``&attr_2:\:code:``=\:code:``&attr_3:\:code:``=\:code:``
686s /usr/lib/python3/dist-packages/azure/purview/catalog/operations/_operations.py:6219: SyntaxWarning: invalid escape sequence '\:'
686s attr:\:code:``=:code:``.
686s /usr/lib/python3/dist-packages/azure/purview/catalog/operations/_operations.py:7024: SyntaxWarning: invalid escape sequence '\:'
686s attr:\:code:``=\:code:``.
686s /usr/lib/python3/dist-packages/azure/purview/catalog/operations/_operations.py:7703: SyntaxWarning: invalid escape sequence '\:'
686s typeName=\:code:``&attr_1:\:code:``=\:code:``&attr_2:\:code:``=\:code:``&attr_3:\:code:``=\:code:``
693s /usr/lib/python3/dist-packages/azure/servicemanagement/schedulermanagementservice.py:59: SyntaxWarning: invalid escape sequence '\m'
693s CURRENT_USER\my\CertificateName format.
693s /usr/lib/python3/dist-packages/azure/servicemanagement/servicebusmanagementservice.py:59: SyntaxWarning: invalid escape sequence '\m'
693s CURRENT_USER\my\CertificateName format.
693s /usr/lib/python3/dist-packages/azure/servicemanagement/servicemanagementservice.py:81: SyntaxWarning: invalid escape sequence '\m'
693s CURRENT_USER\my\CertificateName format.
693s /usr/lib/python3/dist-packages/azure/servicemanagement/sqldatabasemanagementservice.py:55: SyntaxWarning: invalid escape sequence '\m'
693s CURRENT_USER\my\CertificateName format.
693s /usr/lib/python3/dist-packages/azure/servicemanagement/websitemanagementservice.py:55: SyntaxWarning: invalid escape sequence '\m'
693s CURRENT_USER\my\CertificateName format.
694s /usr/lib/python3/dist-packages/azure/synapse/artifacts/models/_models.py:110: SyntaxWarning: invalid escape sequence '\d'
694s ((\d+).)?(\d\d):(60|([0-5][0-9])):(60|([0-5][0-9])).
694s /usr/lib/python3/dist-packages/azure/synapse/artifacts/models/_models.py:1328: SyntaxWarning: invalid escape sequence '\d'
694s string), pattern: ((\d+).)?(\d\d):(60|([0-5][0-9])):(60|([0-5][0-9]))..).
694s /usr/lib/python3/dist-packages/azure/synapse/artifacts/models/_models.py:4218: SyntaxWarning: invalid escape sequence '\d'
694s string), pattern: ((\d+).)?(\d\d):(60|([0-5][0-9])):(60|([0-5][0-9])).
694s /usr/lib/python3/dist-packages/azure/synapse/artifacts/models/_models.py:4280: SyntaxWarning: invalid escape sequence '\d'
694s string), pattern: ((\d+).)?(\d\d):(60|([0-5][0-9])):(60|([0-5][0-9])).
694s /usr/lib/python3/dist-packages/azure/synapse/artifacts/models/_models.py:18198: SyntaxWarning: invalid escape sequence '\d'
694s ((\d+).)?(\d\d):(60|([0-5][0-9])):(60|([0-5][0-9])).
694s /usr/lib/python3/dist-packages/azure/synapse/artifacts/models/_models.py:19096: SyntaxWarning: invalid escape sequence '\d'
694s ((\d+).)?(\d\d):(60|([0-5][0-9])):(60|([0-5][0-9])). Type: string (or Expression with
694s /usr/lib/python3/dist-packages/azure/synapse/artifacts/models/_models.py:19185: SyntaxWarning: invalid escape sequence '\d'
694s ((\d+).)?(\d\d):(60|([0-5][0-9])):(60|([0-5][0-9])).
694s /usr/lib/python3/dist-packages/azure/synapse/artifacts/models/_models.py:19749: SyntaxWarning: invalid escape sequence '\d'
694s ((\d+).)?(\d\d):(60|([0-5][0-9])):(60|([0-5][0-9])).
697s Processing triggers for libc-bin (2.41-6ubuntu1) ...
698s Processing triggers for man-db (2.13.1-1) ...
702s autopkgtest [11:56:46]: test upstream: [-----------------------
715s ============================= test session starts ==============================
715s platform linux -- Python 3.13.3, pytest-8.3.5, pluggy-1.5.0
715s rootdir: /tmp/autopkgtest.hRlEoK/autopkgtest_tmp
715s configfile: setup.cfg
715s testpaths: t/unit/
715s plugins: hypothesis-6.130.5, typeguard-4.4.2
715s collected 1241 items / 2 deselected / 9 skipped / 1239 selected
715s
715s t/unit/asynchronous/http/test_http.py ............s [ 1%]
715s t/unit/asynchronous/test_hub.py ........................................ [ 4%]
716s .......... [ 5%]
716s t/unit/asynchronous/test_semaphore.py . [ 5%]
716s t/unit/asynchronous/test_timer.py ................ [ 6%]
716s t/unit/test_clocks.py ..... [ 6%]
716s t/unit/test_common.py ............................. [ 9%]
716s t/unit/test_compat.py ...................... [ 10%]
716s t/unit/test_compression.py ..s.s..s.s.. [ 11%]
716s t/unit/test_connection.py ..................s........................... [ 15%]
722s ........................................................................ [ 21%]
722s ....... [ 22%]
722s t/unit/test_entity.py .................................................. [ 26%]
722s ......... [ 26%]
722s t/unit/test_exceptions.py . [ 26%]
722s t/unit/test_log.py .................... [ 28%]
722s t/unit/test_matcher.py ... [ 28%]
722s t/unit/test_message.py .... [ 29%]
722s t/unit/test_messaging.py ............................................... [ 32%]
722s ................ [ 34%]
724s t/unit/test_mixins.py ..................... [ 35%]
724s t/unit/test_pidbox.py ........................... [ 38%]
725s t/unit/test_pools.py ......................... [ 40%]
726s t/unit/test_serialization.py ............................... [ 42%]
726s t/unit/test_simple.py ............................ [ 44%]
731s t/unit/transport/test_SQS.py ....................F...................... [ 48%]
731s [ 48%]
731s t/unit/transport/test_azureservicebus.py ......................... [ 50%]
731s t/unit/transport/test_azurestoragequeues.py ...... [ 50%]
731s t/unit/transport/test_base.py .............................. [ 53%]
732s t/unit/transport/test_filesystem.py .... [ 53%]
732s t/unit/transport/test_memory.py ........ [ 54%]
732s t/unit/transport/test_mongodb.py ...................................... [ 57%]
732s t/unit/transport/test_pyamqp.py .......................... [ 59%]
733s t/unit/transport/test_pyro.py .s.ss [ 59%]
733s t/unit/transport/test_qpid.py ssssssssssssssssssssssssssssssssssssssssss [ 63%]
733s ssssssssssssssssssssssssssssssssssssssssssssssssssssssssssssssssssssssss [ 68%]
733s ssssssssssssssssssssssssssssssssssssssssssssssssss [ 72%]
733s t/unit/transport/test_redis.py ......................................... [ 76%]
739s ................................F....................................... [ 82%]
739s .... [ 82%]
739s t/unit/transport/test_sqlalchemy.py ... [ 82%]
739s t/unit/transport/test_transport.py .... [ 82%]
739s t/unit/transport/virtual/test_base.py .................................. [ 85%]
740s ............................ [ 87%]
740s t/unit/transport/virtual/test_exchange.py ......................... [ 89%]
740s t/unit/utils/test_amq_manager.py ... [ 90%]
740s t/unit/utils/test_compat.py ...... [ 90%]
740s t/unit/utils/test_debug.py .. [ 90%]
740s t/unit/utils/test_div.py .. [ 91%]
740s t/unit/utils/test_encoding.py ......... [ 91%]
744s t/unit/utils/test_functional.py .................................. [ 94%]
744s t/unit/utils/test_imports.py ..... [ 94%]
744s t/unit/utils/test_json.py .............. [ 96%]
744s t/unit/utils/test_objects.py ... [ 96%]
744s t/unit/utils/test_scheduling.py ....... [ 96%]
744s t/unit/utils/test_time.py ........ [ 97%]
744s t/unit/utils/test_url.py ................... [ 99%]
744s t/unit/utils/test_utils.py .......... [ 99%]
744s t/unit/utils/test_uuid.py .. [100%]
744s
744s =================================== FAILURES ===================================
744s _________________________ test_Channel.test_get_async __________________________
744s
744s hub = , kwargs = {}
744s
744s def get_client(hub: Hub | None = None, **kwargs: int) -> CurlClient:
744s """Get or create HTTP client bound to the current event loop."""
744s hub = hub or get_event_loop()
744s try:
744s > return hub._current_http_client
744s E AttributeError: 'Hub' object has no attribute '_current_http_client'
744s
744s /usr/lib/python3/dist-packages/kombu/asynchronous/http/__init__.py:25: AttributeError
744s
744s During handling of the above exception, another exception occurred:
744s
744s self =
744s
744s @pytest.mark.usefixtures('hub')
744s def test_get_async(self):
744s """Basic coverage of async code typically used via:
744s basic_consume > _loop1 > _schedule_queue > _get_bulk_async"""
744s # Prepare
744s for i in range(3):
744s message = 'message: %s' % i
744s self.producer.publish(message)
744s
744s # SQS.Channel.asynsqs constructs AsyncSQSConnection using self.sqs
744s # which is already a mock thanks to `setup` above, we just need to
744s # mock the async-specific methods (as test_AsyncSQSConnection does)
744s > async_sqs_conn = self.channel.asynsqs(self.queue_name)
744s
744s t/unit/transport/test_SQS.py:477:
744s _ _ _ _ _ _ _ _ _ _ _ _ _ _ _ _ _ _ _ _ _ _ _ _ _ _ _ _ _ _ _ _ _ _ _ _ _ _ _ _
744s /usr/lib/python3/dist-packages/kombu/transport/SQS.py:827: in asynsqs
744s c = self._asynsqs = AsyncSQSConnection(
744s /usr/lib/python3/dist-packages/kombu/asynchronous/aws/sqs/connection.py:26: in __init__
744s super().__init__(
744s /usr/lib/python3/dist-packages/kombu/asynchronous/aws/connection.py:182: in __init__
744s super().__init__(sqs_connection, http_client,
744s /usr/lib/python3/dist-packages/kombu/asynchronous/aws/connection.py:136: in __init__
744s self._httpclient = http_client or get_client()
744s /usr/lib/python3/dist-packages/kombu/asynchronous/http/__init__.py:27: in get_client
744s client = hub._current_http_client = Client(hub, **kwargs)
744s /usr/lib/python3/dist-packages/kombu/asynchronous/http/__init__.py:18: in Client
744s return CurlClient(hub, **kwargs)
744s _ _ _ _ _ _ _ _ _ _ _ _ _ _ _ _ _ _ _ _ _ _ _ _ _ _ _ _ _ _ _ _ _ _ _ _ _ _ _ _
744s
744s self =
744s hub = , max_clients = 10
744s
744s def __init__(self, hub: Hub | None = None, max_clients: int = 10):
744s if pycurl is None:
744s > raise ImportError('The curl client requires the pycurl library.')
744s E ImportError: The curl client requires the pycurl library.
744s
744s /usr/lib/python3/dist-packages/kombu/asynchronous/http/curl.py:43: ImportError
744s ________________ test_Channel.test_global_keyprefix_transaction ________________
744s
744s self =
744s mock_execute_command =
744s
744s @patch("redis.client.Pipeline.execute_command")
744s def test_global_keyprefix_transaction(self, mock_execute_command):
744s from kombu.transport.redis import PrefixedStrictRedis
744s
744s with Connection(transport=Transport) as conn:
744s def pipeline(transaction=True, shard_hint=None):
744s pipeline_obj = original_pipeline(
744s transaction=transaction, shard_hint=shard_hint
744s )
744s mock_execute_command.side_effect = [
744s None, None, pipeline_obj, pipeline_obj
744s ]
744s return pipeline_obj
744s
744s client = PrefixedStrictRedis(global_keyprefix='foo_')
744s original_pipeline = client.pipeline
744s client.pipeline = pipeline
744s
744s channel = conn.channel()
744s channel._create_client = Mock()
744s channel._create_client.return_value = client
744s
744s channel.qos.restore_by_tag('test-tag')
744s assert mock_execute_command is not None
744s > assert mock_execute_command.mock_calls == [
744s call('WATCH', 'foo_unacked'),
744s call('HGET', 'foo_unacked', 'test-tag'),
744s call('ZREM', 'foo_unacked_index', 'test-tag'),
744s call('HDEL', 'foo_unacked', 'test-tag')
744s ]
744s E AssertionError: assert [call('WATCH'..., 'test-tag')] == [call('WATCH'..., 'test-tag')]
744s E
744s E At index 1 diff: call('HGET', 'foo_unacked', 'test-tag', keys=['unacked']) != call('HGET', 'foo_unacked', 'test-tag')
744s E Use -v to get more diff
744s
744s t/unit/transport/test_redis.py:1329: AssertionError
744s =============================== warnings summary ===============================
744s t/unit/test_compression.py:75
744s /tmp/autopkgtest.hRlEoK/autopkgtest_tmp/t/unit/test_compression.py:75: PytestUnknownMarkWarning: Unknown pytest.mark.masked_modules - is this a typo? You can register custom marks to avoid this warning - for details, see https://docs.pytest.org/en/stable/how-to/mark.html
744s @pytest.mark.masked_modules('bz2')
744s
744s t/unit/test_compression.py:85
744s /tmp/autopkgtest.hRlEoK/autopkgtest_tmp/t/unit/test_compression.py:85: PytestUnknownMarkWarning: Unknown pytest.mark.masked_modules - is this a typo? You can register custom marks to avoid this warning - for details, see https://docs.pytest.org/en/stable/how-to/mark.html
744s @pytest.mark.masked_modules('lzma')
744s
744s t/unit/test_serialization.py:298
744s /tmp/autopkgtest.hRlEoK/autopkgtest_tmp/t/unit/test_serialization.py:298: PytestUnknownMarkWarning: Unknown pytest.mark.masked_modules - is this a typo? You can register custom marks to avoid this warning - for details, see https://docs.pytest.org/en/stable/how-to/mark.html
744s @pytest.mark.masked_modules('yaml')
744s
744s t/unit/test_serialization.py:304
744s /tmp/autopkgtest.hRlEoK/autopkgtest_tmp/t/unit/test_serialization.py:304: PytestUnknownMarkWarning: Unknown pytest.mark.masked_modules - is this a typo? You can register custom marks to avoid this warning - for details, see https://docs.pytest.org/en/stable/how-to/mark.html
744s @pytest.mark.masked_modules('msgpack')
744s
744s t/unit/transport/test_pyamqp.py:143
744s /tmp/autopkgtest.hRlEoK/autopkgtest_tmp/t/unit/transport/test_pyamqp.py:143: PytestUnknownMarkWarning: Unknown pytest.mark.masked_modules - is this a typo? You can register custom marks to avoid this warning - for details, see https://docs.pytest.org/en/stable/how-to/mark.html
744s @pytest.mark.masked_modules('ssl')
744s
744s t/unit/transport/test_redis.py:1347
744s /tmp/autopkgtest.hRlEoK/autopkgtest_tmp/t/unit/transport/test_redis.py:1347: PytestUnknownMarkWarning: Unknown pytest.mark.replace_module_value - is this a typo? You can register custom marks to avoid this warning - for details, see https://docs.pytest.org/en/stable/how-to/mark.html
744s @pytest.mark.replace_module_value(redis.redis, 'VERSION', [3, 0, 0])
744s
744s t/unit/transport/test_redis.py:1360
744s /tmp/autopkgtest.hRlEoK/autopkgtest_tmp/t/unit/transport/test_redis.py:1360: PytestUnknownMarkWarning: Unknown pytest.mark.replace_module_value - is this a typo? You can register custom marks to avoid this warning - for details, see https://docs.pytest.org/en/stable/how-to/mark.html
744s @pytest.mark.replace_module_value(redis.redis, 'VERSION', [2, 5, 10])
744s
744s t/unit/transport/test_redis.py:1465
744s /tmp/autopkgtest.hRlEoK/autopkgtest_tmp/t/unit/transport/test_redis.py:1465: PytestUnknownMarkWarning: Unknown pytest.mark.ensured_modules - is this a typo? You can register custom marks to avoid this warning - for details, see https://docs.pytest.org/en/stable/how-to/mark.html
744s @pytest.mark.ensured_modules(*_redis_modules())
744s
744s t/unit/utils/test_amq_manager.py:12
744s /tmp/autopkgtest.hRlEoK/autopkgtest_tmp/t/unit/utils/test_amq_manager.py:12: PytestUnknownMarkWarning: Unknown pytest.mark.masked_modules - is this a typo? You can register custom marks to avoid this warning - for details, see https://docs.pytest.org/en/stable/how-to/mark.html
744s @pytest.mark.masked_modules('pyrabbit')
744s
744s t/unit/utils/test_amq_manager.py:17
744s /tmp/autopkgtest.hRlEoK/autopkgtest_tmp/t/unit/utils/test_amq_manager.py:17: PytestUnknownMarkWarning: Unknown pytest.mark.ensured_modules - is this a typo? You can register custom marks to avoid this warning - for details, see https://docs.pytest.org/en/stable/how-to/mark.html
744s @pytest.mark.ensured_modules('pyrabbit')
744s
744s t/unit/utils/test_amq_manager.py:26
744s /tmp/autopkgtest.hRlEoK/autopkgtest_tmp/t/unit/utils/test_amq_manager.py:26: PytestUnknownMarkWarning: Unknown pytest.mark.ensured_modules - is this a typo? You can register custom marks to avoid this warning - for details, see https://docs.pytest.org/en/stable/how-to/mark.html
744s @pytest.mark.ensured_modules('pyrabbit')
744s
744s t/unit/utils/test_compat.py:51
744s /tmp/autopkgtest.hRlEoK/autopkgtest_tmp/t/unit/utils/test_compat.py:51: PytestUnknownMarkWarning: Unknown pytest.mark.ensured_modules - is this a typo? You can register custom marks to avoid this warning - for details, see https://docs.pytest.org/en/stable/how-to/mark.html
744s @pytest.mark.ensured_modules('eventlet', 'eventlet.patcher')
744s
744s t/unit/utils/test_compat.py:60
744s /tmp/autopkgtest.hRlEoK/autopkgtest_tmp/t/unit/utils/test_compat.py:60: PytestUnknownMarkWarning: Unknown pytest.mark.ensured_modules - is this a typo? You can register custom marks to avoid this warning - for details, see https://docs.pytest.org/en/stable/how-to/mark.html
744s @pytest.mark.ensured_modules('gevent')
744s
744s t/unit/utils/test_functional.py:186
744s /tmp/autopkgtest.hRlEoK/autopkgtest_tmp/t/unit/utils/test_functional.py:186: PytestUnknownMarkWarning: Unknown pytest.mark.sleepdeprived_patched_module - is this a typo? You can register custom marks to avoid this warning - for details, see https://docs.pytest.org/en/stable/how-to/mark.html
744s @pytest.mark.sleepdeprived_patched_module(utils)
744s
744s t/unit/utils/test_functional.py:221
744s /tmp/autopkgtest.hRlEoK/autopkgtest_tmp/t/unit/utils/test_functional.py:221: PytestUnknownMarkWarning: Unknown pytest.mark.sleepdeprived_patched_module - is this a typo? You can register custom marks to avoid this warning - for details, see https://docs.pytest.org/en/stable/how-to/mark.html
744s @pytest.mark.sleepdeprived_patched_module(utils)
744s
744s t/unit/utils/test_functional.py:236
744s /tmp/autopkgtest.hRlEoK/autopkgtest_tmp/t/unit/utils/test_functional.py:236: PytestUnknownMarkWarning: Unknown pytest.mark.sleepdeprived_patched_module - is this a typo? You can register custom marks to avoid this warning - for details, see https://docs.pytest.org/en/stable/how-to/mark.html
744s @pytest.mark.sleepdeprived_patched_module(utils)
744s
744s t/unit/utils/test_functional.py:251
744s /tmp/autopkgtest.hRlEoK/autopkgtest_tmp/t/unit/utils/test_functional.py:251: PytestUnknownMarkWarning: Unknown pytest.mark.sleepdeprived_patched_module - is this a typo? You can register custom marks to avoid this warning - for details, see https://docs.pytest.org/en/stable/how-to/mark.html
744s @pytest.mark.sleepdeprived_patched_module(utils)
744s
744s t/unit/utils/test_json.py:37
744s /tmp/autopkgtest.hRlEoK/autopkgtest_tmp/t/unit/utils/test_json.py:37: PytestUnknownMarkWarning: Unknown pytest.mark.freeze_time - is this a typo? You can register custom marks to avoid this warning - for details, see https://docs.pytest.org/en/stable/how-to/mark.html
744s @pytest.mark.freeze_time("2015-10-21")
744s
744s t/unit/asynchronous/test_timer.py::test_to_timestamp::test_datetime
744s /tmp/autopkgtest.hRlEoK/autopkgtest_tmp/t/unit/asynchronous/test_timer.py:17: DeprecationWarning: datetime.datetime.utcnow() is deprecated and scheduled for removal in a future version. Use timezone-aware objects to represent datetimes in UTC: datetime.datetime.now(datetime.UTC).
744s assert to_timestamp(datetime.utcnow())
744s
744s t/unit/transport/test_SQS.py::test_Channel::test_sts_session_expired
744s /tmp/autopkgtest.hRlEoK/autopkgtest_tmp/t/unit/transport/test_SQS.py:947: DeprecationWarning: datetime.datetime.utcnow() is deprecated and scheduled for removal in a future version. Use timezone-aware objects to represent datetimes in UTC: datetime.datetime.now(datetime.UTC).
744s channel.sts_expiration = datetime.utcnow() - timedelta(days=1)
744s
744s t/unit/transport/test_SQS.py::test_Channel::test_sts_session_expired
744s /usr/lib/python3/dist-packages/kombu/transport/SQS.py:782: DeprecationWarning: datetime.datetime.utcnow() is deprecated and scheduled for removal in a future version. Use timezone-aware objects to represent datetimes in UTC: datetime.datetime.now(datetime.UTC).
744s elif self.sts_expiration.replace(tzinfo=None) < datetime.utcnow():
744s
744s t/unit/transport/test_SQS.py::test_Channel::test_sts_session_not_expired
744s /tmp/autopkgtest.hRlEoK/autopkgtest_tmp/t/unit/transport/test_SQS.py:976: DeprecationWarning: datetime.datetime.utcnow() is deprecated and scheduled for removal in a future version. Use timezone-aware objects to represent datetimes in UTC: datetime.datetime.now(datetime.UTC).
744s channel.sts_expiration = datetime.utcnow() + timedelta(days=1)
744s
744s t/unit/transport/test_mongodb.py: 38 warnings
744s /tmp/autopkgtest.hRlEoK/autopkgtest_tmp/t/unit/transport/test_mongodb.py:31: DeprecationWarning: datetime.datetime.utcnow() is deprecated and scheduled for removal in a future version. Use timezone-aware objects to represent datetimes in UTC: datetime.datetime.now(datetime.UTC).
744s now = datetime.datetime.utcnow()
744s
744s t/unit/utils/test_json.py::test_JSONEncoder::test_datetime
744s /tmp/autopkgtest.hRlEoK/autopkgtest_tmp/t/unit/utils/test_json.py:39: DeprecationWarning: datetime.datetime.utcnow() is deprecated and scheduled for removal in a future version. Use timezone-aware objects to represent datetimes in UTC: datetime.datetime.now(datetime.UTC).
744s now = datetime.utcnow()
744s
744s t/unit/utils/test_json.py::test_JSONEncoder::test_register_type_with_empty_marker
744s /tmp/autopkgtest.hRlEoK/autopkgtest_tmp/t/unit/utils/test_json.py:116: DeprecationWarning: datetime.datetime.utcnow() is deprecated and scheduled for removal in a future version. Use timezone-aware objects to represent datetimes in UTC: datetime.datetime.now(datetime.UTC).
744s now = datetime.utcnow()
744s
744s -- Docs: https://docs.pytest.org/en/stable/how-to/capture-warnings.html
744s =========================== short test summary info ============================
744s FAILED t/unit/transport/test_SQS.py::test_Channel::test_get_async - ImportErr...
744s FAILED t/unit/transport/test_redis.py::test_Channel::test_global_keyprefix_transaction
744s === 2 failed, 1064 passed, 182 skipped, 2 deselected, 62 warnings in 38.18s ====
744s Restoring 1 unacknowledged message(s)
745s autopkgtest [11:57:29]: test upstream: -----------------------]
745s upstream FAIL non-zero exit status 1
745s autopkgtest [11:57:29]: test upstream: - - - - - - - - - - results - - - - - - - - - -
745s autopkgtest [11:57:29]: @@@@@@@@@@@@@@@@@@@@ summary
745s upstream FAIL non-zero exit status 1
761s nova [W] Using flock in prodstack7-s390x
761s Creating nova instance adt-questing-s390x-kombu-20250506-114504-juju-7f2275-prod-proposed-migration-environment-2-ee21fab7-85d7-446b-82a0-44eb3944a2aa from image adt/ubuntu-questing-s390x-server-20250506.img (UUID fef1f145-d219-47e4-a2ed-77b44eac0376)...
761s nova [W] Timed out waiting for a27061be-6b92-4b74-b66c-30eb36edf1ac to get deleted.