0s autopkgtest [04:24:58]: starting date and time: 2025-02-19 04:24:58+0000 0s autopkgtest [04:24:58]: git checkout: 325255d2 Merge branch 'pin-any-arch' into 'ubuntu/production' 0s autopkgtest [04:24:58]: host juju-7f2275-prod-proposed-migration-environment-15; command line: /home/ubuntu/autopkgtest/runner/autopkgtest --output-dir /tmp/autopkgtest-work.lt606pl4/out --timeout-copy=6000 --setup-commands /home/ubuntu/autopkgtest-cloud/worker-config-production/setup-canonical.sh --apt-pocket=proposed=src:python-crispy-bootstrap4 --apt-upgrade python-crispy-bootstrap4 --timeout-short=300 --timeout-copy=20000 --timeout-build=20000 --env=ADT_TEST_TRIGGERS=python-crispy-bootstrap4/2024.10-1 -- ssh -s /home/ubuntu/autopkgtest/ssh-setup/nova -- --flavor autopkgtest --security-groups autopkgtest-juju-7f2275-prod-proposed-migration-environment-15@bos03-arm64-39.secgroup --name adt-plucky-arm64-python-crispy-bootstrap4-20250219-042458-juju-7f2275-prod-proposed-migration-environment-15-b4134fb9-925a-4548-86ab-9f8de9d973e9 --image adt/ubuntu-plucky-arm64-server --keyname testbed-juju-7f2275-prod-proposed-migration-environment-15 --net-id=net_prod-proposed-migration -e TERM=linux -e ''"'"'http_proxy=http://squid.internal:3128'"'"'' -e ''"'"'https_proxy=http://squid.internal:3128'"'"'' -e ''"'"'no_proxy=127.0.0.1,127.0.1.1,login.ubuntu.com,localhost,localdomain,novalocal,internal,archive.ubuntu.com,ports.ubuntu.com,security.ubuntu.com,ddebs.ubuntu.com,changelogs.ubuntu.com,keyserver.ubuntu.com,launchpadlibrarian.net,launchpadcontent.net,launchpad.net,10.24.0.0/24,keystone.ps5.canonical.com,objectstorage.prodstack5.canonical.com,radosgw.ps5.canonical.com'"'"'' --mirror=http://ftpmaster.internal/ubuntu/ 227s autopkgtest [04:28:45]: testbed dpkg architecture: arm64 229s autopkgtest [04:28:47]: testbed apt version: 2.9.29 230s autopkgtest [04:28:48]: @@@@@@@@@@@@@@@@@@@@ test bed setup 230s autopkgtest [04:28:48]: testbed release detected to be: None 232s autopkgtest [04:28:50]: updating testbed package index (apt update) 232s Get:1 http://ftpmaster.internal/ubuntu plucky-proposed InRelease [110 kB] 232s Hit:2 http://ftpmaster.internal/ubuntu plucky InRelease 232s Hit:3 http://ftpmaster.internal/ubuntu plucky-updates InRelease 232s Hit:4 http://ftpmaster.internal/ubuntu plucky-security InRelease 233s Get:5 http://ftpmaster.internal/ubuntu plucky-proposed/multiverse Sources [14.6 kB] 233s Get:6 http://ftpmaster.internal/ubuntu plucky-proposed/main Sources [79.1 kB] 233s Get:7 http://ftpmaster.internal/ubuntu plucky-proposed/restricted Sources [3120 B] 233s Get:8 http://ftpmaster.internal/ubuntu plucky-proposed/universe Sources [788 kB] 233s Get:9 http://ftpmaster.internal/ubuntu plucky-proposed/main arm64 Packages [97.6 kB] 233s Get:10 http://ftpmaster.internal/ubuntu plucky-proposed/restricted arm64 Packages [7960 B] 233s Get:11 http://ftpmaster.internal/ubuntu plucky-proposed/universe arm64 Packages [698 kB] 233s Get:12 http://ftpmaster.internal/ubuntu plucky-proposed/multiverse arm64 Packages [12.1 kB] 233s Fetched 1811 kB in 1s (1785 kB/s) 234s Reading package lists... 236s + lsb_release --codename --short 236s + RELEASE=plucky 236s + cat 236s + [ plucky != trusty ] 236s + DEBIAN_FRONTEND=noninteractive eatmydata apt-get -y --allow-downgrades -o Dpkg::Options::=--force-confnew dist-upgrade 236s Reading package lists... 236s Building dependency tree... 236s Reading state information... 237s Calculating upgrade... 237s The following packages will be upgraded: 237s dhcpcd-base 237s 1 upgraded, 0 newly installed, 0 to remove and 0 not upgraded. 237s Need to get 216 kB of archives. 237s After this operation, 0 B of additional disk space will be used. 237s Get:1 http://ftpmaster.internal/ubuntu plucky/main arm64 dhcpcd-base arm64 1:10.1.0-7 [216 kB] 238s Fetched 216 kB in 0s (532 kB/s) 238s (Reading database ... (Reading database ... 5% (Reading database ... 10% (Reading database ... 15% (Reading database ... 20% (Reading database ... 25% (Reading database ... 30% (Reading database ... 35% (Reading database ... 40% (Reading database ... 45% (Reading database ... 50% (Reading database ... 55% (Reading database ... 60% (Reading database ... 65% (Reading database ... 70% (Reading database ... 75% (Reading database ... 80% (Reading database ... 85% (Reading database ... 90% (Reading database ... 95% (Reading database ... 100% (Reading database ... 116620 files and directories currently installed.) 238s Preparing to unpack .../dhcpcd-base_1%3a10.1.0-7_arm64.deb ... 238s Unpacking dhcpcd-base (1:10.1.0-7) over (1:10.1.0-6) ... 238s Setting up dhcpcd-base (1:10.1.0-7) ... 238s Processing triggers for man-db (2.13.0-1) ... 239s + rm /etc/apt/preferences.d/force-downgrade-to-release.pref 239s + /usr/lib/apt/apt-helper analyze-pattern ?true 239s + uname -r 239s + sed s/\./\\./g 239s + running_kernel_pattern=^linux-.*6\.12\.0-15-generic.* 239s + + apt list ?obsolete 239s + grep -v ^linux-.*6\.12\.0-15-generic.* 239s + cut -d/ -f1 239s tail -n+2 240s + true 240s + obsolete_pkgs= 240s + DEBIAN_FRONTEND=noninteractive eatmydata apt-get -y purge --autoremove 240s Reading package lists... 240s Building dependency tree... 240s Reading state information... 241s 0 upgraded, 0 newly installed, 0 to remove and 0 not upgraded. 241s + grep -q trusty /etc/lsb-release 241s + [ ! -d /usr/share/doc/unattended-upgrades ] 241s + [ ! -d /usr/share/doc/lxd ] 241s + [ ! -d /usr/share/doc/lxd-client ] 241s + [ ! -d /usr/share/doc/snapd ] 241s + type iptables 241s + cat 241s + chmod 755 /etc/rc.local 241s + . /etc/rc.local 241s + iptables -w -t mangle -A FORWARD -p tcp --tcp-flags SYN,RST SYN -j TCPMSS --clamp-mss-to-pmtu 241s + iptables -A OUTPUT -d 10.255.255.1/32 -p tcp -j DROP 241s + iptables -A OUTPUT -d 10.255.255.2/32 -p tcp -j DROP 241s + uname -m 241s + [ aarch64 = ppc64le ] 241s + [ -d /run/systemd/system ] 241s + systemd-detect-virt --quiet --vm 241s + mkdir -p /etc/systemd/system/systemd-random-seed.service.d/ 241s + cat 241s + grep -q lz4 /etc/initramfs-tools/initramfs.conf 241s + echo COMPRESS=lz4 241s autopkgtest [04:28:59]: upgrading testbed (apt dist-upgrade and autopurge) 242s Reading package lists... 242s Building dependency tree... 242s Reading state information... 242s Calculating upgrade...Starting pkgProblemResolver with broken count: 0 243s Starting 2 pkgProblemResolver with broken count: 0 243s Done 243s Entering ResolveByKeep 244s 244s 0 upgraded, 0 newly installed, 0 to remove and 0 not upgraded. 245s Reading package lists... 245s Building dependency tree... 245s Reading state information... 246s Starting pkgProblemResolver with broken count: 0 246s Starting 2 pkgProblemResolver with broken count: 0 246s Done 246s 0 upgraded, 0 newly installed, 0 to remove and 0 not upgraded. 249s autopkgtest [04:29:07]: testbed running kernel: Linux 6.12.0-15-generic #15-Ubuntu SMP PREEMPT_DYNAMIC Tue Feb 4 15:49:33 UTC 2025 250s autopkgtest [04:29:08]: @@@@@@@@@@@@@@@@@@@@ apt-source python-crispy-bootstrap4 251s Get:1 http://ftpmaster.internal/ubuntu plucky-proposed/universe python-crispy-bootstrap4 2024.10-1 (dsc) [2022 B] 251s Get:2 http://ftpmaster.internal/ubuntu plucky-proposed/universe python-crispy-bootstrap4 2024.10-1 (tar) [32.3 kB] 251s Get:3 http://ftpmaster.internal/ubuntu plucky-proposed/universe python-crispy-bootstrap4 2024.10-1 (diff) [2900 B] 251s gpgv: Signature made Mon Oct 14 20:45:55 2024 UTC 251s gpgv: using RSA key A954A54575BCED49240A725CFFD3C88B997DD16A 251s gpgv: Can't check signature: No public key 251s dpkg-source: warning: cannot verify inline signature for ./python-crispy-bootstrap4_2024.10-1.dsc: no acceptable signature found 251s autopkgtest [04:29:09]: testing package python-crispy-bootstrap4 version 2024.10-1 252s autopkgtest [04:29:10]: build not needed 252s autopkgtest [04:29:10]: test upstream: preparing testbed 252s Reading package lists... 253s Building dependency tree... 253s Reading state information... 253s Starting pkgProblemResolver with broken count: 0 253s Starting 2 pkgProblemResolver with broken count: 0 253s Done 254s The following NEW packages will be installed: 254s autoconf automake autopoint autotools-dev build-essential cpp cpp-14 254s cpp-14-aarch64-linux-gnu cpp-aarch64-linux-gnu debhelper debugedit 254s dh-autoreconf dh-python dh-strip-nondeterminism dwz g++ g++-14 254s g++-14-aarch64-linux-gnu g++-aarch64-linux-gnu gcc gcc-14 254s gcc-14-aarch64-linux-gnu gcc-aarch64-linux-gnu gettext intltool-debian 254s libarchive-zip-perl libasan8 libcc1-0 libdebhelper-perl 254s libfile-stripnondeterminism-perl libgcc-14-dev libgomp1 libhwasan0 libisl23 254s libitm1 libjs-jquery libjs-jquery-hotkeys libjs-jquery-isonscreen 254s libjs-jquery-metadata libjs-jquery-tablesorter 254s libjs-jquery-throttle-debounce liblsan0 libmpc3 libstdc++-14-dev libtool 254s libtsan2 libubsan1 m4 po-debconf pybuild-plugin-pyproject python3-all 254s python3-asgiref python3-build python3-coverage python3-crispy-bootstrap4 254s python3-django python3-django-crispy-forms python3-iniconfig 254s python3-installer python3-packaging python3-pluggy python3-pyproject-hooks 254s python3-pytest python3-pytest-cov python3-pytest-django python3-sqlparse 254s python3-toml python3-wheel python3.12 python3.12-minimal 254s 0 upgraded, 70 newly installed, 0 to remove and 0 not upgraded. 254s Need to get 71.9 MB of archives. 254s After this operation, 262 MB of additional disk space will be used. 254s Get:1 http://ftpmaster.internal/ubuntu plucky/main arm64 python3.12-minimal arm64 3.12.9-1 [2236 kB] 255s Get:2 http://ftpmaster.internal/ubuntu plucky/main arm64 python3.12 arm64 3.12.9-1 [671 kB] 255s Get:3 http://ftpmaster.internal/ubuntu plucky/main arm64 m4 arm64 1.4.19-5 [244 kB] 255s Get:4 http://ftpmaster.internal/ubuntu plucky/main arm64 autoconf all 2.72-3 [382 kB] 255s Get:5 http://ftpmaster.internal/ubuntu plucky/main arm64 autotools-dev all 20220109.1 [44.9 kB] 255s Get:6 http://ftpmaster.internal/ubuntu plucky/main arm64 automake all 1:1.17-3 [572 kB] 255s Get:7 http://ftpmaster.internal/ubuntu plucky/main arm64 autopoint all 0.23.1-1 [619 kB] 255s Get:8 http://ftpmaster.internal/ubuntu plucky/main arm64 libisl23 arm64 0.27-1 [676 kB] 255s Get:9 http://ftpmaster.internal/ubuntu plucky/main arm64 libmpc3 arm64 1.3.1-1build2 [56.8 kB] 255s Get:10 http://ftpmaster.internal/ubuntu plucky/main arm64 cpp-14-aarch64-linux-gnu arm64 14.2.0-17ubuntu1 [10.6 MB] 255s Get:11 http://ftpmaster.internal/ubuntu plucky/main arm64 cpp-14 arm64 14.2.0-17ubuntu1 [1032 B] 255s Get:12 http://ftpmaster.internal/ubuntu plucky/main arm64 cpp-aarch64-linux-gnu arm64 4:14.2.0-1ubuntu1 [5558 B] 255s Get:13 http://ftpmaster.internal/ubuntu plucky/main arm64 cpp arm64 4:14.2.0-1ubuntu1 [22.4 kB] 255s Get:14 http://ftpmaster.internal/ubuntu plucky/main arm64 libcc1-0 arm64 15-20250213-1ubuntu1 [44.2 kB] 255s Get:15 http://ftpmaster.internal/ubuntu plucky/main arm64 libgomp1 arm64 15-20250213-1ubuntu1 [146 kB] 255s Get:16 http://ftpmaster.internal/ubuntu plucky/main arm64 libitm1 arm64 15-20250213-1ubuntu1 [28.0 kB] 255s Get:17 http://ftpmaster.internal/ubuntu plucky/main arm64 libasan8 arm64 15-20250213-1ubuntu1 [2928 kB] 255s Get:18 http://ftpmaster.internal/ubuntu plucky/main arm64 liblsan0 arm64 15-20250213-1ubuntu1 [1319 kB] 255s Get:19 http://ftpmaster.internal/ubuntu plucky/main arm64 libtsan2 arm64 15-20250213-1ubuntu1 [2695 kB] 255s Get:20 http://ftpmaster.internal/ubuntu plucky/main arm64 libubsan1 arm64 15-20250213-1ubuntu1 [1178 kB] 255s Get:21 http://ftpmaster.internal/ubuntu plucky/main arm64 libhwasan0 arm64 15-20250213-1ubuntu1 [1642 kB] 255s Get:22 http://ftpmaster.internal/ubuntu plucky/main arm64 libgcc-14-dev arm64 14.2.0-17ubuntu1 [2593 kB] 256s Get:23 http://ftpmaster.internal/ubuntu plucky/main arm64 gcc-14-aarch64-linux-gnu arm64 14.2.0-17ubuntu1 [20.9 MB] 257s Get:24 http://ftpmaster.internal/ubuntu plucky/main arm64 gcc-14 arm64 14.2.0-17ubuntu1 [526 kB] 257s Get:25 http://ftpmaster.internal/ubuntu plucky/main arm64 gcc-aarch64-linux-gnu arm64 4:14.2.0-1ubuntu1 [1200 B] 257s Get:26 http://ftpmaster.internal/ubuntu plucky/main arm64 gcc arm64 4:14.2.0-1ubuntu1 [4998 B] 257s Get:27 http://ftpmaster.internal/ubuntu plucky/main arm64 libstdc++-14-dev arm64 14.2.0-17ubuntu1 [2499 kB] 257s Get:28 http://ftpmaster.internal/ubuntu plucky/main arm64 g++-14-aarch64-linux-gnu arm64 14.2.0-17ubuntu1 [12.1 MB] 257s Get:29 http://ftpmaster.internal/ubuntu plucky/main arm64 g++-14 arm64 14.2.0-17ubuntu1 [21.8 kB] 257s Get:30 http://ftpmaster.internal/ubuntu plucky/main arm64 g++-aarch64-linux-gnu arm64 4:14.2.0-1ubuntu1 [956 B] 257s Get:31 http://ftpmaster.internal/ubuntu plucky/main arm64 g++ arm64 4:14.2.0-1ubuntu1 [1080 B] 257s Get:32 http://ftpmaster.internal/ubuntu plucky/main arm64 build-essential arm64 12.10ubuntu1 [4932 B] 257s Get:33 http://ftpmaster.internal/ubuntu plucky/main arm64 libdebhelper-perl all 13.24.1ubuntu2 [95.4 kB] 257s Get:34 http://ftpmaster.internal/ubuntu plucky/main arm64 libtool all 2.5.4-3build1 [168 kB] 257s Get:35 http://ftpmaster.internal/ubuntu plucky/main arm64 dh-autoreconf all 20 [16.1 kB] 257s Get:36 http://ftpmaster.internal/ubuntu plucky/main arm64 libarchive-zip-perl all 1.68-1 [90.2 kB] 257s Get:37 http://ftpmaster.internal/ubuntu plucky/main arm64 libfile-stripnondeterminism-perl all 1.14.1-2 [20.3 kB] 257s Get:38 http://ftpmaster.internal/ubuntu plucky/main arm64 dh-strip-nondeterminism all 1.14.1-2 [5064 B] 257s Get:39 http://ftpmaster.internal/ubuntu plucky/main arm64 debugedit arm64 1:5.1-2 [46.1 kB] 257s Get:40 http://ftpmaster.internal/ubuntu plucky/main arm64 dwz arm64 0.15-1build6 [113 kB] 257s Get:41 http://ftpmaster.internal/ubuntu plucky/main arm64 gettext arm64 0.23.1-1 [998 kB] 257s Get:42 http://ftpmaster.internal/ubuntu plucky/main arm64 intltool-debian all 0.35.0+20060710.6 [23.2 kB] 257s Get:43 http://ftpmaster.internal/ubuntu plucky/main arm64 po-debconf all 1.0.21+nmu1 [233 kB] 257s Get:44 http://ftpmaster.internal/ubuntu plucky/main arm64 debhelper all 13.24.1ubuntu2 [895 kB] 257s Get:45 http://ftpmaster.internal/ubuntu plucky/universe arm64 dh-python all 6.20250108 [117 kB] 257s Get:46 http://ftpmaster.internal/ubuntu plucky/main arm64 libjs-jquery all 3.6.1+dfsg+~3.5.14-1 [328 kB] 257s Get:47 http://ftpmaster.internal/ubuntu plucky/universe arm64 libjs-jquery-metadata all 12-4 [6582 B] 257s Get:48 http://ftpmaster.internal/ubuntu plucky/universe arm64 libjs-jquery-tablesorter all 1:2.31.3+dfsg1-4 [192 kB] 257s Get:49 http://ftpmaster.internal/ubuntu plucky/universe arm64 libjs-jquery-throttle-debounce all 1.1+dfsg.1-2 [12.5 kB] 258s Get:50 http://ftpmaster.internal/ubuntu plucky/main arm64 python3-packaging all 24.2-1 [51.5 kB] 258s Get:51 http://ftpmaster.internal/ubuntu plucky/universe arm64 python3-pyproject-hooks all 1.2.0-1 [10.2 kB] 258s Get:52 http://ftpmaster.internal/ubuntu plucky/universe arm64 python3-toml all 0.10.2-1 [16.5 kB] 258s Get:53 http://ftpmaster.internal/ubuntu plucky/universe arm64 python3-wheel all 0.45.1-1 [57.7 kB] 258s Get:54 http://ftpmaster.internal/ubuntu plucky/universe arm64 python3-build all 1.2.2-1 [31.0 kB] 258s Get:55 http://ftpmaster.internal/ubuntu plucky/universe arm64 python3-installer all 0.7.0+dfsg1-3 [17.4 kB] 258s Get:56 http://ftpmaster.internal/ubuntu plucky/universe arm64 pybuild-plugin-pyproject all 6.20250108 [1726 B] 258s Get:57 http://ftpmaster.internal/ubuntu plucky/main arm64 python3-all arm64 3.13.1-1~exp2 [894 B] 258s Get:58 http://ftpmaster.internal/ubuntu plucky/main arm64 python3-asgiref all 3.8.1-1 [24.8 kB] 258s Get:59 http://ftpmaster.internal/ubuntu plucky/universe arm64 python3-coverage arm64 7.4.4+dfsg1-0ubuntu3 [150 kB] 258s Get:60 http://ftpmaster.internal/ubuntu plucky/main arm64 python3-sqlparse all 0.5.3-1 [32.9 kB] 258s Get:61 http://ftpmaster.internal/ubuntu plucky/main arm64 python3-django all 3:4.2.18-1 [2918 kB] 258s Get:62 http://ftpmaster.internal/ubuntu plucky/universe arm64 python3-django-crispy-forms all 1.14.0-4ubuntu1 [58.1 kB] 258s Get:63 http://ftpmaster.internal/ubuntu plucky-proposed/universe arm64 python3-crispy-bootstrap4 all 2024.10-1 [10.5 kB] 258s Get:64 http://ftpmaster.internal/ubuntu plucky/universe arm64 python3-iniconfig all 1.1.1-2 [6024 B] 258s Get:65 http://ftpmaster.internal/ubuntu plucky/universe arm64 python3-pluggy all 1.5.0-1 [21.0 kB] 258s Get:66 http://ftpmaster.internal/ubuntu plucky/universe arm64 python3-pytest all 8.3.4-1 [252 kB] 258s Get:67 http://ftpmaster.internal/ubuntu plucky/universe arm64 libjs-jquery-hotkeys all 0.2.0-1 [13.3 kB] 258s Get:68 http://ftpmaster.internal/ubuntu plucky/universe arm64 libjs-jquery-isonscreen all 1.2.0-1.1 [3244 B] 258s Get:69 http://ftpmaster.internal/ubuntu plucky/universe arm64 python3-pytest-cov all 5.0.0-1 [21.3 kB] 258s Get:70 http://ftpmaster.internal/ubuntu plucky/universe arm64 python3-pytest-django all 4.5.2-3 [18.5 kB] 258s Fetched 71.9 MB in 4s (18.6 MB/s) 258s Selecting previously unselected package python3.12-minimal. 258s (Reading database ... (Reading database ... 5% (Reading database ... 10% (Reading database ... 15% (Reading database ... 20% (Reading database ... 25% (Reading database ... 30% (Reading database ... 35% (Reading database ... 40% (Reading database ... 45% (Reading database ... 50% (Reading database ... 55% (Reading database ... 60% (Reading database ... 65% (Reading database ... 70% (Reading database ... 75% (Reading database ... 80% (Reading database ... 85% (Reading database ... 90% (Reading database ... 95% (Reading database ... 100% (Reading database ... 116620 files and directories currently installed.) 258s Preparing to unpack .../00-python3.12-minimal_3.12.9-1_arm64.deb ... 258s Unpacking python3.12-minimal (3.12.9-1) ... 258s Selecting previously unselected package python3.12. 258s Preparing to unpack .../01-python3.12_3.12.9-1_arm64.deb ... 258s Unpacking python3.12 (3.12.9-1) ... 259s Selecting previously unselected package m4. 259s Preparing to unpack .../02-m4_1.4.19-5_arm64.deb ... 259s Unpacking m4 (1.4.19-5) ... 259s Selecting previously unselected package autoconf. 259s Preparing to unpack .../03-autoconf_2.72-3_all.deb ... 259s Unpacking autoconf (2.72-3) ... 259s Selecting previously unselected package autotools-dev. 259s Preparing to unpack .../04-autotools-dev_20220109.1_all.deb ... 259s Unpacking autotools-dev (20220109.1) ... 259s Selecting previously unselected package automake. 259s Preparing to unpack .../05-automake_1%3a1.17-3_all.deb ... 259s Unpacking automake (1:1.17-3) ... 259s Selecting previously unselected package autopoint. 259s Preparing to unpack .../06-autopoint_0.23.1-1_all.deb ... 259s Unpacking autopoint (0.23.1-1) ... 259s Selecting previously unselected package libisl23:arm64. 259s Preparing to unpack .../07-libisl23_0.27-1_arm64.deb ... 259s Unpacking libisl23:arm64 (0.27-1) ... 259s Selecting previously unselected package libmpc3:arm64. 259s Preparing to unpack .../08-libmpc3_1.3.1-1build2_arm64.deb ... 259s Unpacking libmpc3:arm64 (1.3.1-1build2) ... 259s Selecting previously unselected package cpp-14-aarch64-linux-gnu. 259s Preparing to unpack .../09-cpp-14-aarch64-linux-gnu_14.2.0-17ubuntu1_arm64.deb ... 259s Unpacking cpp-14-aarch64-linux-gnu (14.2.0-17ubuntu1) ... 259s Selecting previously unselected package cpp-14. 259s Preparing to unpack .../10-cpp-14_14.2.0-17ubuntu1_arm64.deb ... 259s Unpacking cpp-14 (14.2.0-17ubuntu1) ... 259s Selecting previously unselected package cpp-aarch64-linux-gnu. 259s Preparing to unpack .../11-cpp-aarch64-linux-gnu_4%3a14.2.0-1ubuntu1_arm64.deb ... 259s Unpacking cpp-aarch64-linux-gnu (4:14.2.0-1ubuntu1) ... 259s Selecting previously unselected package cpp. 259s Preparing to unpack .../12-cpp_4%3a14.2.0-1ubuntu1_arm64.deb ... 259s Unpacking cpp (4:14.2.0-1ubuntu1) ... 259s Selecting previously unselected package libcc1-0:arm64. 259s Preparing to unpack .../13-libcc1-0_15-20250213-1ubuntu1_arm64.deb ... 259s Unpacking libcc1-0:arm64 (15-20250213-1ubuntu1) ... 259s Selecting previously unselected package libgomp1:arm64. 259s Preparing to unpack .../14-libgomp1_15-20250213-1ubuntu1_arm64.deb ... 259s Unpacking libgomp1:arm64 (15-20250213-1ubuntu1) ... 259s Selecting previously unselected package libitm1:arm64. 259s Preparing to unpack .../15-libitm1_15-20250213-1ubuntu1_arm64.deb ... 259s Unpacking libitm1:arm64 (15-20250213-1ubuntu1) ... 259s Selecting previously unselected package libasan8:arm64. 259s Preparing to unpack .../16-libasan8_15-20250213-1ubuntu1_arm64.deb ... 259s Unpacking libasan8:arm64 (15-20250213-1ubuntu1) ... 260s Selecting previously unselected package liblsan0:arm64. 260s Preparing to unpack .../17-liblsan0_15-20250213-1ubuntu1_arm64.deb ... 260s Unpacking liblsan0:arm64 (15-20250213-1ubuntu1) ... 260s Selecting previously unselected package libtsan2:arm64. 260s Preparing to unpack .../18-libtsan2_15-20250213-1ubuntu1_arm64.deb ... 260s Unpacking libtsan2:arm64 (15-20250213-1ubuntu1) ... 260s Selecting previously unselected package libubsan1:arm64. 260s Preparing to unpack .../19-libubsan1_15-20250213-1ubuntu1_arm64.deb ... 260s Unpacking libubsan1:arm64 (15-20250213-1ubuntu1) ... 260s Selecting previously unselected package libhwasan0:arm64. 260s Preparing to unpack .../20-libhwasan0_15-20250213-1ubuntu1_arm64.deb ... 260s Unpacking libhwasan0:arm64 (15-20250213-1ubuntu1) ... 260s Selecting previously unselected package libgcc-14-dev:arm64. 260s Preparing to unpack .../21-libgcc-14-dev_14.2.0-17ubuntu1_arm64.deb ... 260s Unpacking libgcc-14-dev:arm64 (14.2.0-17ubuntu1) ... 260s Selecting previously unselected package gcc-14-aarch64-linux-gnu. 260s Preparing to unpack .../22-gcc-14-aarch64-linux-gnu_14.2.0-17ubuntu1_arm64.deb ... 260s Unpacking gcc-14-aarch64-linux-gnu (14.2.0-17ubuntu1) ... 260s Selecting previously unselected package gcc-14. 260s Preparing to unpack .../23-gcc-14_14.2.0-17ubuntu1_arm64.deb ... 260s Unpacking gcc-14 (14.2.0-17ubuntu1) ... 260s Selecting previously unselected package gcc-aarch64-linux-gnu. 260s Preparing to unpack .../24-gcc-aarch64-linux-gnu_4%3a14.2.0-1ubuntu1_arm64.deb ... 260s Unpacking gcc-aarch64-linux-gnu (4:14.2.0-1ubuntu1) ... 260s Selecting previously unselected package gcc. 260s Preparing to unpack .../25-gcc_4%3a14.2.0-1ubuntu1_arm64.deb ... 260s Unpacking gcc (4:14.2.0-1ubuntu1) ... 261s Selecting previously unselected package libstdc++-14-dev:arm64. 261s Preparing to unpack .../26-libstdc++-14-dev_14.2.0-17ubuntu1_arm64.deb ... 261s Unpacking libstdc++-14-dev:arm64 (14.2.0-17ubuntu1) ... 261s Selecting previously unselected package g++-14-aarch64-linux-gnu. 261s Preparing to unpack .../27-g++-14-aarch64-linux-gnu_14.2.0-17ubuntu1_arm64.deb ... 261s Unpacking g++-14-aarch64-linux-gnu (14.2.0-17ubuntu1) ... 261s Selecting previously unselected package g++-14. 261s Preparing to unpack .../28-g++-14_14.2.0-17ubuntu1_arm64.deb ... 261s Unpacking g++-14 (14.2.0-17ubuntu1) ... 261s Selecting previously unselected package g++-aarch64-linux-gnu. 261s Preparing to unpack .../29-g++-aarch64-linux-gnu_4%3a14.2.0-1ubuntu1_arm64.deb ... 261s Unpacking g++-aarch64-linux-gnu (4:14.2.0-1ubuntu1) ... 261s Selecting previously unselected package g++. 261s Preparing to unpack .../30-g++_4%3a14.2.0-1ubuntu1_arm64.deb ... 261s Unpacking g++ (4:14.2.0-1ubuntu1) ... 261s Selecting previously unselected package build-essential. 261s Preparing to unpack .../31-build-essential_12.10ubuntu1_arm64.deb ... 261s Unpacking build-essential (12.10ubuntu1) ... 261s Selecting previously unselected package libdebhelper-perl. 261s Preparing to unpack .../32-libdebhelper-perl_13.24.1ubuntu2_all.deb ... 261s Unpacking libdebhelper-perl (13.24.1ubuntu2) ... 261s Selecting previously unselected package libtool. 261s Preparing to unpack .../33-libtool_2.5.4-3build1_all.deb ... 261s Unpacking libtool (2.5.4-3build1) ... 261s Selecting previously unselected package dh-autoreconf. 261s Preparing to unpack .../34-dh-autoreconf_20_all.deb ... 261s Unpacking dh-autoreconf (20) ... 261s Selecting previously unselected package libarchive-zip-perl. 261s Preparing to unpack .../35-libarchive-zip-perl_1.68-1_all.deb ... 261s Unpacking libarchive-zip-perl (1.68-1) ... 261s Selecting previously unselected package libfile-stripnondeterminism-perl. 261s Preparing to unpack .../36-libfile-stripnondeterminism-perl_1.14.1-2_all.deb ... 261s Unpacking libfile-stripnondeterminism-perl (1.14.1-2) ... 261s Selecting previously unselected package dh-strip-nondeterminism. 261s Preparing to unpack .../37-dh-strip-nondeterminism_1.14.1-2_all.deb ... 261s Unpacking dh-strip-nondeterminism (1.14.1-2) ... 261s Selecting previously unselected package debugedit. 262s Preparing to unpack .../38-debugedit_1%3a5.1-2_arm64.deb ... 262s Unpacking debugedit (1:5.1-2) ... 262s Selecting previously unselected package dwz. 262s Preparing to unpack .../39-dwz_0.15-1build6_arm64.deb ... 262s Unpacking dwz (0.15-1build6) ... 262s Selecting previously unselected package gettext. 262s Preparing to unpack .../40-gettext_0.23.1-1_arm64.deb ... 262s Unpacking gettext (0.23.1-1) ... 262s Selecting previously unselected package intltool-debian. 262s Preparing to unpack .../41-intltool-debian_0.35.0+20060710.6_all.deb ... 262s Unpacking intltool-debian (0.35.0+20060710.6) ... 262s Selecting previously unselected package po-debconf. 262s Preparing to unpack .../42-po-debconf_1.0.21+nmu1_all.deb ... 262s Unpacking po-debconf (1.0.21+nmu1) ... 262s Selecting previously unselected package debhelper. 262s Preparing to unpack .../43-debhelper_13.24.1ubuntu2_all.deb ... 262s Unpacking debhelper (13.24.1ubuntu2) ... 262s Selecting previously unselected package dh-python. 262s Preparing to unpack .../44-dh-python_6.20250108_all.deb ... 262s Unpacking dh-python (6.20250108) ... 262s Selecting previously unselected package libjs-jquery. 262s Preparing to unpack .../45-libjs-jquery_3.6.1+dfsg+~3.5.14-1_all.deb ... 262s Unpacking libjs-jquery (3.6.1+dfsg+~3.5.14-1) ... 262s Selecting previously unselected package libjs-jquery-metadata. 262s Preparing to unpack .../46-libjs-jquery-metadata_12-4_all.deb ... 262s Unpacking libjs-jquery-metadata (12-4) ... 262s Selecting previously unselected package libjs-jquery-tablesorter. 262s Preparing to unpack .../47-libjs-jquery-tablesorter_1%3a2.31.3+dfsg1-4_all.deb ... 262s Unpacking libjs-jquery-tablesorter (1:2.31.3+dfsg1-4) ... 262s Selecting previously unselected package libjs-jquery-throttle-debounce. 262s Preparing to unpack .../48-libjs-jquery-throttle-debounce_1.1+dfsg.1-2_all.deb ... 262s Unpacking libjs-jquery-throttle-debounce (1.1+dfsg.1-2) ... 262s Selecting previously unselected package python3-packaging. 262s Preparing to unpack .../49-python3-packaging_24.2-1_all.deb ... 262s Unpacking python3-packaging (24.2-1) ... 262s Selecting previously unselected package python3-pyproject-hooks. 262s Preparing to unpack .../50-python3-pyproject-hooks_1.2.0-1_all.deb ... 262s Unpacking python3-pyproject-hooks (1.2.0-1) ... 262s Selecting previously unselected package python3-toml. 262s Preparing to unpack .../51-python3-toml_0.10.2-1_all.deb ... 262s Unpacking python3-toml (0.10.2-1) ... 262s Selecting previously unselected package python3-wheel. 262s Preparing to unpack .../52-python3-wheel_0.45.1-1_all.deb ... 262s Unpacking python3-wheel (0.45.1-1) ... 262s Selecting previously unselected package python3-build. 262s Preparing to unpack .../53-python3-build_1.2.2-1_all.deb ... 262s Unpacking python3-build (1.2.2-1) ... 262s Selecting previously unselected package python3-installer. 262s Preparing to unpack .../54-python3-installer_0.7.0+dfsg1-3_all.deb ... 262s Unpacking python3-installer (0.7.0+dfsg1-3) ... 262s Selecting previously unselected package pybuild-plugin-pyproject. 262s Preparing to unpack .../55-pybuild-plugin-pyproject_6.20250108_all.deb ... 262s Unpacking pybuild-plugin-pyproject (6.20250108) ... 262s Selecting previously unselected package python3-all. 263s Preparing to unpack .../56-python3-all_3.13.1-1~exp2_arm64.deb ... 263s Unpacking python3-all (3.13.1-1~exp2) ... 263s Selecting previously unselected package python3-asgiref. 263s Preparing to unpack .../57-python3-asgiref_3.8.1-1_all.deb ... 263s Unpacking python3-asgiref (3.8.1-1) ... 263s Selecting previously unselected package python3-coverage. 263s Preparing to unpack .../58-python3-coverage_7.4.4+dfsg1-0ubuntu3_arm64.deb ... 263s Unpacking python3-coverage (7.4.4+dfsg1-0ubuntu3) ... 263s Selecting previously unselected package python3-sqlparse. 263s Preparing to unpack .../59-python3-sqlparse_0.5.3-1_all.deb ... 263s Unpacking python3-sqlparse (0.5.3-1) ... 263s Selecting previously unselected package python3-django. 263s Preparing to unpack .../60-python3-django_3%3a4.2.18-1_all.deb ... 263s Unpacking python3-django (3:4.2.18-1) ... 264s Selecting previously unselected package python3-django-crispy-forms. 264s Preparing to unpack .../61-python3-django-crispy-forms_1.14.0-4ubuntu1_all.deb ... 264s Unpacking python3-django-crispy-forms (1.14.0-4ubuntu1) ... 264s Selecting previously unselected package python3-crispy-bootstrap4. 264s Preparing to unpack .../62-python3-crispy-bootstrap4_2024.10-1_all.deb ... 264s Unpacking python3-crispy-bootstrap4 (2024.10-1) ... 264s Selecting previously unselected package python3-iniconfig. 264s Preparing to unpack .../63-python3-iniconfig_1.1.1-2_all.deb ... 264s Unpacking python3-iniconfig (1.1.1-2) ... 264s Selecting previously unselected package python3-pluggy. 264s Preparing to unpack .../64-python3-pluggy_1.5.0-1_all.deb ... 264s Unpacking python3-pluggy (1.5.0-1) ... 264s Selecting previously unselected package python3-pytest. 264s Preparing to unpack .../65-python3-pytest_8.3.4-1_all.deb ... 264s Unpacking python3-pytest (8.3.4-1) ... 264s Selecting previously unselected package libjs-jquery-hotkeys. 264s Preparing to unpack .../66-libjs-jquery-hotkeys_0.2.0-1_all.deb ... 264s Unpacking libjs-jquery-hotkeys (0.2.0-1) ... 264s Selecting previously unselected package libjs-jquery-isonscreen. 264s Preparing to unpack .../67-libjs-jquery-isonscreen_1.2.0-1.1_all.deb ... 264s Unpacking libjs-jquery-isonscreen (1.2.0-1.1) ... 264s Selecting previously unselected package python3-pytest-cov. 264s Preparing to unpack .../68-python3-pytest-cov_5.0.0-1_all.deb ... 264s Unpacking python3-pytest-cov (5.0.0-1) ... 264s Selecting previously unselected package python3-pytest-django. 264s Preparing to unpack .../69-python3-pytest-django_4.5.2-3_all.deb ... 264s Unpacking python3-pytest-django (4.5.2-3) ... 264s Setting up dh-python (6.20250108) ... 264s Setting up python3-iniconfig (1.1.1-2) ... 264s Setting up python3.12-minimal (3.12.9-1) ... 265s Setting up libarchive-zip-perl (1.68-1) ... 265s Setting up libdebhelper-perl (13.24.1ubuntu2) ... 265s Setting up python3.12 (3.12.9-1) ... 267s Setting up m4 (1.4.19-5) ... 267s Setting up python3-all (3.13.1-1~exp2) ... 267s Setting up python3-coverage (7.4.4+dfsg1-0ubuntu3) ... 267s Setting up libjs-jquery-throttle-debounce (1.1+dfsg.1-2) ... 267s Setting up libgomp1:arm64 (15-20250213-1ubuntu1) ... 267s Setting up python3-wheel (0.45.1-1) ... 267s Setting up autotools-dev (20220109.1) ... 267s Setting up python3-packaging (24.2-1) ... 268s Setting up python3-sqlparse (0.5.3-1) ... 268s Setting up python3-pyproject-hooks (1.2.0-1) ... 268s Setting up libmpc3:arm64 (1.3.1-1build2) ... 268s Setting up autopoint (0.23.1-1) ... 268s Setting up python3-toml (0.10.2-1) ... 268s Setting up python3-installer (0.7.0+dfsg1-3) ... 268s Setting up autoconf (2.72-3) ... 268s Setting up python3-pluggy (1.5.0-1) ... 269s Setting up libubsan1:arm64 (15-20250213-1ubuntu1) ... 269s Setting up dwz (0.15-1build6) ... 269s Setting up libhwasan0:arm64 (15-20250213-1ubuntu1) ... 269s Setting up libasan8:arm64 (15-20250213-1ubuntu1) ... 269s Setting up debugedit (1:5.1-2) ... 269s Setting up libtsan2:arm64 (15-20250213-1ubuntu1) ... 269s Setting up libjs-jquery (3.6.1+dfsg+~3.5.14-1) ... 269s Setting up libjs-jquery-hotkeys (0.2.0-1) ... 269s Setting up libisl23:arm64 (0.27-1) ... 269s Setting up python3-build (1.2.2-1) ... 269s Setting up libcc1-0:arm64 (15-20250213-1ubuntu1) ... 269s Setting up liblsan0:arm64 (15-20250213-1ubuntu1) ... 269s Setting up libitm1:arm64 (15-20250213-1ubuntu1) ... 269s Setting up python3-asgiref (3.8.1-1) ... 269s Setting up automake (1:1.17-3) ... 269s update-alternatives: using /usr/bin/automake-1.17 to provide /usr/bin/automake (automake) in auto mode 269s Setting up libfile-stripnondeterminism-perl (1.14.1-2) ... 269s Setting up gettext (0.23.1-1) ... 269s Setting up python3-django (3:4.2.18-1) ... 272s Setting up pybuild-plugin-pyproject (6.20250108) ... 272s Setting up python3-pytest (8.3.4-1) ... 273s Setting up python3-pytest-django (4.5.2-3) ... 273s Setting up intltool-debian (0.35.0+20060710.6) ... 273s Setting up libjs-jquery-metadata (12-4) ... 273s Setting up libjs-jquery-isonscreen (1.2.0-1.1) ... 273s Setting up dh-strip-nondeterminism (1.14.1-2) ... 273s Setting up libjs-jquery-tablesorter (1:2.31.3+dfsg1-4) ... 273s Setting up cpp-14-aarch64-linux-gnu (14.2.0-17ubuntu1) ... 273s Setting up python3-django-crispy-forms (1.14.0-4ubuntu1) ... 273s Setting up libgcc-14-dev:arm64 (14.2.0-17ubuntu1) ... 273s Setting up libstdc++-14-dev:arm64 (14.2.0-17ubuntu1) ... 273s Setting up po-debconf (1.0.21+nmu1) ... 273s Setting up python3-crispy-bootstrap4 (2024.10-1) ... 273s Setting up python3-pytest-cov (5.0.0-1) ... 273s Setting up cpp-aarch64-linux-gnu (4:14.2.0-1ubuntu1) ... 273s Setting up cpp-14 (14.2.0-17ubuntu1) ... 273s Setting up cpp (4:14.2.0-1ubuntu1) ... 274s Setting up gcc-14-aarch64-linux-gnu (14.2.0-17ubuntu1) ... 274s Setting up gcc-aarch64-linux-gnu (4:14.2.0-1ubuntu1) ... 274s Setting up g++-14-aarch64-linux-gnu (14.2.0-17ubuntu1) ... 274s Setting up gcc-14 (14.2.0-17ubuntu1) ... 274s Setting up g++-aarch64-linux-gnu (4:14.2.0-1ubuntu1) ... 274s Setting up g++-14 (14.2.0-17ubuntu1) ... 274s Setting up libtool (2.5.4-3build1) ... 274s Setting up gcc (4:14.2.0-1ubuntu1) ... 274s Setting up dh-autoreconf (20) ... 274s Setting up g++ (4:14.2.0-1ubuntu1) ... 274s update-alternatives: using /usr/bin/g++ to provide /usr/bin/c++ (c++) in auto mode 274s Setting up build-essential (12.10ubuntu1) ... 274s Setting up debhelper (13.24.1ubuntu2) ... 274s Processing triggers for man-db (2.13.0-1) ... 275s Processing triggers for install-info (7.1.1-1) ... 275s Processing triggers for libc-bin (2.40-4ubuntu1) ... 275s Processing triggers for systemd (257.2-3ubuntu1) ... 276s autopkgtest [04:29:34]: test upstream: [----------------------- 277s ============================= test session starts ============================== 277s platform linux -- Python 3.12.9, pytest-8.3.4, pluggy-1.5.0 277s django: settings: tests.test_settings (from ini) 277s rootdir: /tmp/autopkgtest.rKoceP/autopkgtest_tmp 277s configfile: setup.cfg 277s plugins: django-4.5.2, typeguard-4.4.1, cov-5.0.0 277s collected 106 items / 2 deselected / 104 selected 277s 278s tests/test_form_helper.py ............................... [ 29%] 278s tests/test_layout.py ............................sss.s. [ 62%] 278s tests/test_layout_objects.py ...........FF...F.........s [ 88%] 278s tests/test_tags.py ............ [100%] 278s 278s =================================== FAILURES =================================== 278s ________ TestBootstrapLayoutObjects.test_accordion_css_class_is_applied ________ 278s 278s self = 278s 278s def test_accordion_css_class_is_applied(self): 278s classes = "one two three" 278s test_form = SampleForm() 278s test_form.helper = FormHelper() 278s test_form.helper.form_tag = False 278s test_form.helper.layout = Layout( 278s Accordion( 278s AccordionGroup("one", "first_name"), 278s css_class=classes, 278s css_id="super-accordion", 278s ) 278s ) 278s html = render_crispy_form(test_form) 278s 278s > assert html.count('
(('
= '\n\n
\n
\n\n\n'.count 278s 278s tests/test_layout_objects.py:264: AssertionError 278s _____ TestBootstrapLayoutObjects.test_accordion_group_css_class_is_applied _____ 278s 278s self = 278s 278s def test_accordion_group_css_class_is_applied(self): 278s classes = "one two three" 278s test_form = SampleForm() 278s test_form.helper = FormHelper() 278s test_form.helper.form_tag = False 278s test_form.helper.layout = Layout( 278s Accordion( 278s AccordionGroup("one", "first_name"), 278s AccordionGroup("two", "password1", "password2", css_class=classes), 278s ) 278s ) 278s html = render_crispy_form(test_form) 278s 278s > assert html.count('
(('
= '\n\n
\n
\n\n\n'.count 278s 278s tests/test_layout_objects.py:279: AssertionError 278s ______________ TestBootstrapLayoutObjects.test_tab_and_tab_holder ______________ 278s 278s self = 278s 278s def test_tab_and_tab_holder(self): 278s test_form = SampleForm() 278s test_form.helper = FormHelper() 278s test_form.helper.layout = Layout( 278s TabHolder( 278s Tab( 278s "one", 278s "first_name", 278s css_id="custom-name", 278s css_class="first-tab-class", 278s ), 278s Tab("two", "password1", "password2"), 278s css_class="test-tab-holder-class", 278s ) 278s ) 278s > assert parse_form(test_form) == parse_expected( 278s "bootstrap4/test_layout_objects/test_tab_and_tab_holder.html" 278s ) 278s E assert
\n
==
\n
278s E 278s E Use -v to get more diff 278s 278s tests/test_layout_objects.py:342: AssertionError 278s =========================== short test summary info ============================ 278s FAILED tests/test_layout_objects.py::TestBootstrapLayoutObjects::test_accordion_css_class_is_applied 278s FAILED tests/test_layout_objects.py::TestBootstrapLayoutObjects::test_accordion_group_css_class_is_applied 278s FAILED tests/test_layout_objects.py::TestBootstrapLayoutObjects::test_tab_and_tab_holder 278s ============ 3 failed, 96 passed, 5 skipped, 2 deselected in 1.12s ============= 279s autopkgtest [04:29:37]: test upstream: -----------------------] 279s upstream FAIL non-zero exit status 1 279s autopkgtest [04:29:37]: test upstream: - - - - - - - - - - results - - - - - - - - - - 279s autopkgtest [04:29:37]: @@@@@@@@@@@@@@@@@@@@ summary 279s upstream FAIL non-zero exit status 1 297s nova [W] Using flock in prodstack6-arm64 297s flock: timeout while waiting to get lock 297s Creating nova instance adt-plucky-arm64-python-crispy-bootstrap4-20250219-042458-juju-7f2275-prod-proposed-migration-environment-15-b4134fb9-925a-4548-86ab-9f8de9d973e9 from image adt/ubuntu-plucky-arm64-server-20250218.img (UUID db1e3557-ca0b-4978-8424-9ef955671030)... 297s nova [W] Timed out waiting for ca70e4c4-e865-4a82-9e5b-8017310c9ac9 to get deleted.