0s autopkgtest [09:27:03]: starting date and time: 2025-04-14 09:27:03+0000
  0s autopkgtest [09:27:03]: git checkout: 9986aa8c Merge branch 'skia/fix_network_interface' into 'ubuntu/production'
  0s autopkgtest [09:27:03]: host juju-7f2275-prod-proposed-migration-environment-23; command line: /home/ubuntu/autopkgtest/runner/autopkgtest --output-dir /tmp/autopkgtest-work.i1lopbed/out --timeout-copy=6000 --setup-commands /home/ubuntu/autopkgtest-cloud/worker-config-production/setup-canonical.sh --apt-pocket=proposed=src:libimage-exiftool-perl --apt-upgrade mat2 --timeout-short=300 --timeout-copy=20000 --timeout-build=20000 --env=ADT_TEST_TRIGGERS=libimage-exiftool-perl/13.25+dfsg-1 -- ssh -s /home/ubuntu/autopkgtest/ssh-setup/nova -- --flavor autopkgtest --security-groups autopkgtest-juju-7f2275-prod-proposed-migration-environment-23@bos03-arm64-17.secgroup --name adt-plucky-arm64-mat2-20250414-092703-juju-7f2275-prod-proposed-migration-environment-23-992e9178-8c0b-41e7-8ee8-36f44ca968cc --image adt/ubuntu-plucky-arm64-server --keyname testbed-juju-7f2275-prod-proposed-migration-environment-23 --net-id=net_prod-proposed-migration -e TERM=linux --mirror=http://ftpmaster.internal/ubuntu/
165s autopkgtest [09:29:48]: testbed dpkg architecture: arm64
165s autopkgtest [09:29:48]: testbed apt version: 3.0.0
165s autopkgtest [09:29:48]: @@@@@@@@@@@@@@@@@@@@ test bed setup
166s autopkgtest [09:29:49]: testbed release detected to be: None
166s autopkgtest [09:29:49]: updating testbed package index (apt update)
167s Get:1 http://ftpmaster.internal/ubuntu plucky-proposed InRelease [265 kB]
167s Hit:2 http://ftpmaster.internal/ubuntu plucky InRelease
167s Hit:3 http://ftpmaster.internal/ubuntu plucky-updates InRelease
167s Hit:4 http://ftpmaster.internal/ubuntu plucky-security InRelease
167s Get:5 http://ftpmaster.internal/ubuntu plucky-proposed/universe Sources [204 kB]
167s Get:6 http://ftpmaster.internal/ubuntu plucky-proposed/multiverse Sources [9948 B]
167s Get:7 http://ftpmaster.internal/ubuntu plucky-proposed/main Sources [5192 B]
167s Get:8 http://ftpmaster.internal/ubuntu plucky-proposed/main arm64 Packages [3176 B]
167s Get:9 http://ftpmaster.internal/ubuntu plucky-proposed/main arm64 c-n-f Metadata [252 B]
167s Get:10 http://ftpmaster.internal/ubuntu plucky-proposed/restricted arm64 c-n-f Metadata [224 B]
167s Get:11 http://ftpmaster.internal/ubuntu plucky-proposed/universe arm64 Packages [129 kB]
167s Get:12 http://ftpmaster.internal/ubuntu plucky-proposed/universe arm64 c-n-f Metadata [8288 B]
167s Get:13 http://ftpmaster.internal/ubuntu plucky-proposed/multiverse arm64 Packages [2004 B]
167s Get:14 http://ftpmaster.internal/ubuntu plucky-proposed/multiverse arm64 c-n-f Metadata [324 B]
169s Fetched 628 kB in 1s (782 kB/s)
170s Reading package lists...
170s autopkgtest [09:29:53]: upgrading testbed (apt dist-upgrade and autopurge)
171s Reading package lists...
171s Building dependency tree...
171s Reading state information...
171s Calculating upgrade...Starting pkgProblemResolver with broken count: 0
172s Starting 2 pkgProblemResolver with broken count: 0
172s Done
172s Entering ResolveByKeep
173s 
173s Calculating upgrade...
173s 0 upgraded, 0 newly installed, 0 to remove and 0 not upgraded.
173s Reading package lists...
174s Building dependency tree...
174s Reading state information...
174s Starting pkgProblemResolver with broken count: 0
174s Starting 2 pkgProblemResolver with broken count: 0
174s Done
175s Solving dependencies...
175s 0 upgraded, 0 newly installed, 0 to remove and 0 not upgraded.
178s autopkgtest [09:30:01]: testbed running kernel: Linux 6.14.0-15-generic #15-Ubuntu SMP PREEMPT_DYNAMIC Sun Apr  6 14:37:51 UTC 2025
178s autopkgtest [09:30:01]: @@@@@@@@@@@@@@@@@@@@ apt-source mat2
180s Get:1 http://ftpmaster.internal/ubuntu plucky/universe mat2 0.13.5-1 (dsc) [1575 B]
180s Get:2 http://ftpmaster.internal/ubuntu plucky/universe mat2 0.13.5-1 (tar) [10.6 MB]
180s Get:3 http://ftpmaster.internal/ubuntu plucky/universe mat2 0.13.5-1 (diff) [10.1 kB]
180s gpgv: Signature made Thu Jan  9 08:13:01 2025 UTC
180s gpgv:                using EDDSA key C47EBFCC4E57E9FC32CA3400461BEE5D240A9E91
180s gpgv: Can't check signature: No public key
180s dpkg-source: warning: cannot verify inline signature for ./mat2_0.13.5-1.dsc: no acceptable signature found
181s autopkgtest [09:30:04]: testing package mat2 version 0.13.5-1
181s autopkgtest [09:30:04]: build not needed
182s autopkgtest [09:30:05]: test command1: preparing testbed
182s Reading package lists...
182s Building dependency tree...
182s Reading state information...
183s Starting pkgProblemResolver with broken count: 0
183s Starting 2 pkgProblemResolver with broken count: 0
183s Done
184s The following NEW packages will be installed:
184s   ffmpeg fontconfig fontconfig-config fonts-dejavu-core fonts-dejavu-mono
184s   gir1.2-freedesktop gir1.2-gdkpixbuf-2.0 gir1.2-poppler-0.18 gir1.2-rsvg-2.0
184s   libaom3 libasound2-data libasound2t64 libass9 libasyncns0 libavc1394-0
184s   libavcodec61 libavdevice61 libavfilter10 libavformat61 libavutil59 libblas3
184s   libbluray2 libbs2b0 libcaca0 libcairo-gobject2 libcairo2 libcdio-cdda2t64
184s   libcdio-paranoia2t64 libcdio19t64 libchromaprint1 libcjson1 libcodec2-1.2
184s   libdatrie1 libdav1d7 libdc1394-25 libdecor-0-0 libdeflate0 libdvdnav4
184s   libdvdread8t64 libfftw3-double3 libflac14 libflite1 libfontconfig1 libgbm1
184s   libgdk-pixbuf-2.0-0 libgdk-pixbuf2.0-common libgfortran5 libgl1
184s   libgl1-mesa-dri libglvnd0 libglx-mesa0 libglx0 libgme0 libgomp1
184s   libgpgmepp6t64 libgraphite2-3 libgsm1 libharfbuzz0b libhwy1t64 libiec61883-0
184s   libimage-exiftool-perl libjack-jackd2-0 libjbig0 libjpeg-turbo8 libjpeg8
184s   libjxl0.11 liblapack3 liblcms2-2 liblerc4 liblilv-0-0 libmbedcrypto16
184s   libmp3lame0 libmpg123-0t64 libmysofa1 libnorm1t64 libogg0 libopenal-data
184s   libopenal1 libopenjp2-7 libopenmpt0t64 libopus0 libpango-1.0-0
184s   libpangocairo-1.0-0 libpangoft2-1.0-0 libpgm-5.3-0t64 libpixman-1-0
184s   libplacebo349 libpocketsphinx3 libpoppler-glib8t64 libpoppler147
184s   libpostproc58 libpulse0 librabbitmq4 librav1e0.7 libraw1394-11 librist4
184s   librsvg2-2 librubberband2 libsamplerate0 libsdl2-2.0-0 libserd-0-0
184s   libsharpyuv0 libshine3 libsnappy1v5 libsndfile1 libsodium23 libsord-0-0
184s   libsoxr0 libspeex1 libsphinxbase3t64 libsratom-0-0 libsrt1.5-gnutls libssh-4
184s   libsvtav1enc2 libswresample5 libswscale8 libthai-data libthai0 libtheoradec1
184s   libtheoraenc1 libtiff6 libtwolame0 libudfread0 libunibreak6 libva-drm2
184s   libva-x11-2 libva2 libvdpau1 libvidstab1.1 libvorbis0a libvorbisenc2
184s   libvorbisfile3 libvpx9 libvulkan1 libwayland-client0 libwayland-cursor0
184s   libwayland-egl1 libwayland-server0 libwebp7 libwebpmux3 libx11-xcb1
184s   libx264-164 libx265-215 libxcb-dri3-0 libxcb-glx0 libxcb-present0
184s   libxcb-randr0 libxcb-render0 libxcb-shape0 libxcb-shm0 libxcb-sync1
184s   libxcb-xfixes0 libxcursor1 libxfixes3 libxi6 libxrandr2 libxrender1
184s   libxshmfence1 libxss1 libxv1 libxvidcore4 libxxf86vm1 libzimg2 libzix-0-0
184s   libzmq5 libzvbi-common libzvbi0t64 mat2 mesa-libgallium ocl-icd-libopencl1
184s   python3-cairo python3-gi-cairo python3-iniconfig python3-mutagen
184s   python3-packaging python3-pluggy python3-pytest x11-common
184s 0 upgraded, 178 newly installed, 0 to remove and 0 not upgraded.
184s Need to get 92.4 MB of archives.
184s After this operation, 265 MB of additional disk space will be used.
184s Get:1 http://ftpmaster.internal/ubuntu plucky/main arm64 libaom3 arm64 3.12.0-1 [1828 kB]
184s Get:2 http://ftpmaster.internal/ubuntu plucky/main arm64 libva2 arm64 2.22.0-3ubuntu2 [73.3 kB]
184s Get:3 http://ftpmaster.internal/ubuntu plucky/main arm64 libva-drm2 arm64 2.22.0-3ubuntu2 [7172 B]
184s Get:4 http://ftpmaster.internal/ubuntu plucky/main arm64 libx11-xcb1 arm64 2:1.8.10-2 [8020 B]
184s Get:5 http://ftpmaster.internal/ubuntu plucky/main arm64 libxcb-dri3-0 arm64 1.17.0-2 [7606 B]
184s Get:6 http://ftpmaster.internal/ubuntu plucky/main arm64 libxfixes3 arm64 1:6.0.0-2build1 [11.2 kB]
184s Get:7 http://ftpmaster.internal/ubuntu plucky/universe arm64 libva-x11-2 arm64 2.22.0-3ubuntu2 [12.3 kB]
184s Get:8 http://ftpmaster.internal/ubuntu plucky/main arm64 libvdpau1 arm64 1.5-3 [26.4 kB]
184s Get:9 http://ftpmaster.internal/ubuntu plucky/universe arm64 ocl-icd-libopencl1 arm64 2.3.2-1build1 [37.6 kB]
184s Get:10 http://ftpmaster.internal/ubuntu plucky/universe arm64 libavutil59 arm64 7:7.1.1-1ubuntu1 [402 kB]
184s Get:11 http://ftpmaster.internal/ubuntu plucky/main arm64 fonts-dejavu-mono all 2.37-8 [502 kB]
184s Get:12 http://ftpmaster.internal/ubuntu plucky/main arm64 fonts-dejavu-core all 2.37-8 [835 kB]
185s Get:13 http://ftpmaster.internal/ubuntu plucky/main arm64 fontconfig-config arm64 2.15.0-2.2ubuntu1 [37.9 kB]
185s Get:14 http://ftpmaster.internal/ubuntu plucky/main arm64 libfontconfig1 arm64 2.15.0-2.2ubuntu1 [144 kB]
185s Get:15 http://ftpmaster.internal/ubuntu plucky/main arm64 libpixman-1-0 arm64 0.44.0-3 [197 kB]
185s Get:16 http://ftpmaster.internal/ubuntu plucky/main arm64 libxcb-render0 arm64 1.17.0-2 [16.6 kB]
185s Get:17 http://ftpmaster.internal/ubuntu plucky/main arm64 libxcb-shm0 arm64 1.17.0-2 [5884 B]
185s Get:18 http://ftpmaster.internal/ubuntu plucky/main arm64 libxrender1 arm64 1:0.9.10-1.1build1 [18.8 kB]
185s Get:19 http://ftpmaster.internal/ubuntu plucky/main arm64 libcairo2 arm64 1.18.4-1 [560 kB]
185s Get:20 http://ftpmaster.internal/ubuntu plucky/universe arm64 libcodec2-1.2 arm64 1.2.0-3 [8999 kB]
185s Get:21 http://ftpmaster.internal/ubuntu plucky/universe arm64 libdav1d7 arm64 1.5.1-1 [304 kB]
185s Get:22 http://ftpmaster.internal/ubuntu plucky/universe arm64 libgsm1 arm64 1.0.22-1build1 [27.0 kB]
185s Get:23 http://ftpmaster.internal/ubuntu plucky/main arm64 libhwy1t64 arm64 1.2.0-3ubuntu3 [605 kB]
185s Get:24 http://ftpmaster.internal/ubuntu plucky/main arm64 liblcms2-2 arm64 2.16-2 [170 kB]
185s Get:25 http://ftpmaster.internal/ubuntu plucky/main arm64 libjxl0.11 arm64 0.11.1-4 [936 kB]
185s Get:26 http://ftpmaster.internal/ubuntu plucky/main arm64 libmp3lame0 arm64 3.100-6build1 [141 kB]
185s Get:27 http://ftpmaster.internal/ubuntu plucky/main arm64 libopenjp2-7 arm64 2.5.3-2 [183 kB]
185s Get:28 http://ftpmaster.internal/ubuntu plucky/main arm64 libopus0 arm64 1.5.2-2 [2891 kB]
185s Get:29 http://ftpmaster.internal/ubuntu plucky/universe arm64 librav1e0.7 arm64 0.7.1-9 [763 kB]
185s Get:30 http://ftpmaster.internal/ubuntu plucky/main arm64 libcairo-gobject2 arm64 1.18.4-1 [127 kB]
185s Get:31 http://ftpmaster.internal/ubuntu plucky/main arm64 libgdk-pixbuf2.0-common all 2.42.12+dfsg-2 [8004 B]
185s Get:32 http://ftpmaster.internal/ubuntu plucky/main arm64 libjpeg-turbo8 arm64 2.1.5-3ubuntu2 [165 kB]
185s Get:33 http://ftpmaster.internal/ubuntu plucky/main arm64 libjpeg8 arm64 8c-2ubuntu11 [2148 B]
185s Get:34 http://ftpmaster.internal/ubuntu plucky/main arm64 libdeflate0 arm64 1.23-1 [46.2 kB]
185s Get:35 http://ftpmaster.internal/ubuntu plucky/main arm64 libjbig0 arm64 2.1-6.1ubuntu2 [29.3 kB]
185s Get:36 http://ftpmaster.internal/ubuntu plucky/main arm64 liblerc4 arm64 4.0.0+ds-5ubuntu1 [167 kB]
185s Get:37 http://ftpmaster.internal/ubuntu plucky/main arm64 libsharpyuv0 arm64 1.5.0-0.1 [16.9 kB]
185s Get:38 http://ftpmaster.internal/ubuntu plucky/main arm64 libwebp7 arm64 1.5.0-0.1 [194 kB]
185s Get:39 http://ftpmaster.internal/ubuntu plucky/main arm64 libtiff6 arm64 4.5.1+git230720-4ubuntu4 [193 kB]
185s Get:40 http://ftpmaster.internal/ubuntu plucky/main arm64 libgdk-pixbuf-2.0-0 arm64 2.42.12+dfsg-2 [147 kB]
185s Get:41 http://ftpmaster.internal/ubuntu plucky/main arm64 fontconfig arm64 2.15.0-2.2ubuntu1 [191 kB]
185s Get:42 http://ftpmaster.internal/ubuntu plucky/main arm64 libgraphite2-3 arm64 1.3.14-2ubuntu1 [70.6 kB]
185s Get:43 http://ftpmaster.internal/ubuntu plucky/main arm64 libharfbuzz0b arm64 10.2.0-1 [490 kB]
185s Get:44 http://ftpmaster.internal/ubuntu plucky/main arm64 libthai-data all 0.1.29-2build1 [158 kB]
185s Get:45 http://ftpmaster.internal/ubuntu plucky/main arm64 libdatrie1 arm64 0.2.13-3build1 [19.2 kB]
185s Get:46 http://ftpmaster.internal/ubuntu plucky/main arm64 libthai0 arm64 0.1.29-2build1 [18.2 kB]
185s Get:47 http://ftpmaster.internal/ubuntu plucky/main arm64 libpango-1.0-0 arm64 1.56.3-1 [238 kB]
185s Get:48 http://ftpmaster.internal/ubuntu plucky/main arm64 libpangoft2-1.0-0 arm64 1.56.3-1 [49.8 kB]
185s Get:49 http://ftpmaster.internal/ubuntu plucky/main arm64 libpangocairo-1.0-0 arm64 1.56.3-1 [27.6 kB]
185s Get:50 http://ftpmaster.internal/ubuntu plucky/main arm64 librsvg2-2 arm64 2.60.0+dfsg-1 [1721 kB]
185s Get:51 http://ftpmaster.internal/ubuntu plucky/universe arm64 libshine3 arm64 3.1.1-2build1 [25.8 kB]
185s Get:52 http://ftpmaster.internal/ubuntu plucky/main arm64 libsnappy1v5 arm64 1.2.1-1 [30.4 kB]
185s Get:53 http://ftpmaster.internal/ubuntu plucky/main arm64 libspeex1 arm64 1.2.1-3 [56.9 kB]
185s Get:54 http://ftpmaster.internal/ubuntu plucky/universe arm64 libsvtav1enc2 arm64 2.3.0+dfsg-1 [1832 kB]
185s Get:55 http://ftpmaster.internal/ubuntu plucky/main arm64 libgomp1 arm64 15-20250404-0ubuntu1 [147 kB]
185s Get:56 http://ftpmaster.internal/ubuntu plucky/universe arm64 libsoxr0 arm64 0.1.3-4build3 [56.4 kB]
185s Get:57 http://ftpmaster.internal/ubuntu plucky/universe arm64 libswresample5 arm64 7:7.1.1-1ubuntu1 [58.2 kB]
185s Get:58 http://ftpmaster.internal/ubuntu plucky/main arm64 libtheoradec1 arm64 1.2.0~alpha1+dfsg-6 [57.1 kB]
185s Get:59 http://ftpmaster.internal/ubuntu plucky/main arm64 libogg0 arm64 1.3.5-3build1 [22.6 kB]
185s Get:60 http://ftpmaster.internal/ubuntu plucky/main arm64 libtheoraenc1 arm64 1.2.0~alpha1+dfsg-6 [107 kB]
185s Get:61 http://ftpmaster.internal/ubuntu plucky/main arm64 libtwolame0 arm64 0.4.0-2build3 [51.7 kB]
185s Get:62 http://ftpmaster.internal/ubuntu plucky/main arm64 libvorbis0a arm64 1.3.7-2 [95.0 kB]
185s Get:63 http://ftpmaster.internal/ubuntu plucky/main arm64 libvorbisenc2 arm64 1.3.7-2 [80.0 kB]
185s Get:64 http://ftpmaster.internal/ubuntu plucky/main arm64 libvpx9 arm64 1.15.0-2 [1347 kB]
185s Get:65 http://ftpmaster.internal/ubuntu plucky/main arm64 libwebpmux3 arm64 1.5.0-0.1 [25.4 kB]
185s Get:66 http://ftpmaster.internal/ubuntu plucky/universe arm64 libx264-164 arm64 2:0.164.3108+git31e19f9-2build2 [559 kB]
185s Get:67 http://ftpmaster.internal/ubuntu plucky/universe arm64 libx265-215 arm64 4.1-2 [2297 kB]
185s Get:68 http://ftpmaster.internal/ubuntu plucky/universe arm64 libxvidcore4 arm64 2:1.3.7-1build1 [180 kB]
185s Get:69 http://ftpmaster.internal/ubuntu plucky/universe arm64 libzvbi-common all 0.2.44-1ubuntu1 [42.9 kB]
185s Get:70 http://ftpmaster.internal/ubuntu plucky/universe arm64 libzvbi0t64 arm64 0.2.44-1ubuntu1 [261 kB]
185s Get:71 http://ftpmaster.internal/ubuntu plucky/universe arm64 libavcodec61 arm64 7:7.1.1-1ubuntu1 [6222 kB]
186s Get:72 http://ftpmaster.internal/ubuntu plucky/main arm64 libasound2-data all 1.2.13-1build1 [21.1 kB]
186s Get:73 http://ftpmaster.internal/ubuntu plucky/main arm64 libasound2t64 arm64 1.2.13-1build1 [390 kB]
186s Get:74 http://ftpmaster.internal/ubuntu plucky/main arm64 libraw1394-11 arm64 2.1.2-2build3 [26.9 kB]
186s Get:75 http://ftpmaster.internal/ubuntu plucky/main arm64 libavc1394-0 arm64 0.5.4-5build3 [15.8 kB]
186s Get:76 http://ftpmaster.internal/ubuntu plucky/universe arm64 libunibreak6 arm64 6.1-2 [25.9 kB]
186s Get:77 http://ftpmaster.internal/ubuntu plucky/universe arm64 libass9 arm64 1:0.17.3-1 [100 kB]
186s Get:78 http://ftpmaster.internal/ubuntu plucky/universe arm64 libudfread0 arm64 1.1.2-1build1 [17.0 kB]
186s Get:79 http://ftpmaster.internal/ubuntu plucky/universe arm64 libbluray2 arm64 1:1.3.4-1build1 [149 kB]
186s Get:80 http://ftpmaster.internal/ubuntu plucky/universe arm64 libchromaprint1 arm64 1.5.1-7 [30.2 kB]
186s Get:81 http://ftpmaster.internal/ubuntu plucky/universe arm64 libdvdread8t64 arm64 6.1.3-2 [53.1 kB]
186s Get:82 http://ftpmaster.internal/ubuntu plucky/universe arm64 libdvdnav4 arm64 6.1.1-3build1 [37.8 kB]
186s Get:83 http://ftpmaster.internal/ubuntu plucky/universe arm64 libgme0 arm64 0.6.3-7build1 [129 kB]
186s Get:84 http://ftpmaster.internal/ubuntu plucky/main arm64 libmpg123-0t64 arm64 1.32.10-1 [173 kB]
186s Get:85 http://ftpmaster.internal/ubuntu plucky/main arm64 libvorbisfile3 arm64 1.3.7-2 [17.1 kB]
186s Get:86 http://ftpmaster.internal/ubuntu plucky/universe arm64 libopenmpt0t64 arm64 0.7.13-1build1 [642 kB]
186s Get:87 http://ftpmaster.internal/ubuntu plucky/main arm64 librabbitmq4 arm64 0.15.0-1 [37.8 kB]
186s Get:88 http://ftpmaster.internal/ubuntu plucky/universe arm64 libcjson1 arm64 1.7.18-3 [22.1 kB]
186s Get:89 http://ftpmaster.internal/ubuntu plucky/universe arm64 libmbedcrypto16 arm64 3.6.2-3ubuntu1 [258 kB]
186s Get:90 http://ftpmaster.internal/ubuntu plucky/universe arm64 librist4 arm64 0.2.11+dfsg-1 [77.6 kB]
186s Get:91 http://ftpmaster.internal/ubuntu plucky/universe arm64 libsrt1.5-gnutls arm64 1.5.4-1 [319 kB]
186s Get:92 http://ftpmaster.internal/ubuntu plucky/main arm64 libssh-4 arm64 0.11.1-1 [208 kB]
186s Get:93 http://ftpmaster.internal/ubuntu plucky/universe arm64 libnorm1t64 arm64 1.5.9+dfsg-3.1build1 [150 kB]
186s Get:94 http://ftpmaster.internal/ubuntu plucky/universe arm64 libpgm-5.3-0t64 arm64 5.3.128~dfsg-2.1build1 [162 kB]
186s Get:95 http://ftpmaster.internal/ubuntu plucky/main arm64 libsodium23 arm64 1.0.18-1build3 [119 kB]
186s Get:96 http://ftpmaster.internal/ubuntu plucky/universe arm64 libzmq5 arm64 4.3.5-1build2 [247 kB]
186s Get:97 http://ftpmaster.internal/ubuntu plucky/universe arm64 libavformat61 arm64 7:7.1.1-1ubuntu1 [1242 kB]
186s Get:98 http://ftpmaster.internal/ubuntu plucky/universe arm64 libbs2b0 arm64 3.1.0+dfsg-8 [9900 B]
186s Get:99 http://ftpmaster.internal/ubuntu plucky/universe arm64 libflite1 arm64 2.2-7 [13.5 MB]
186s Get:100 http://ftpmaster.internal/ubuntu plucky/universe arm64 libserd-0-0 arm64 0.32.4-1 [44.2 kB]
186s Get:101 http://ftpmaster.internal/ubuntu plucky/universe arm64 libzix-0-0 arm64 0.6.2-1 [25.0 kB]
186s Get:102 http://ftpmaster.internal/ubuntu plucky/universe arm64 libsord-0-0 arm64 0.16.18-1 [15.8 kB]
186s Get:103 http://ftpmaster.internal/ubuntu plucky/universe arm64 libsratom-0-0 arm64 0.6.18-1 [16.1 kB]
186s Get:104 http://ftpmaster.internal/ubuntu plucky/universe arm64 liblilv-0-0 arm64 0.24.26-1 [40.7 kB]
187s Get:105 http://ftpmaster.internal/ubuntu plucky/universe arm64 libmysofa1 arm64 1.3.3+dfsg-1ubuntu1 [1158 kB]
187s Get:106 http://ftpmaster.internal/ubuntu plucky/main arm64 libvulkan1 arm64 1.4.304.0-1 [158 kB]
187s Get:107 http://ftpmaster.internal/ubuntu plucky/universe arm64 libplacebo349 arm64 7.349.0-3 [2662 kB]
187s Get:108 http://ftpmaster.internal/ubuntu plucky/main arm64 libblas3 arm64 3.12.1-2 [161 kB]
187s Get:109 http://ftpmaster.internal/ubuntu plucky/main arm64 libgfortran5 arm64 15-20250404-0ubuntu1 [444 kB]
187s Get:110 http://ftpmaster.internal/ubuntu plucky/main arm64 liblapack3 arm64 3.12.1-2 [2307 kB]
187s Get:111 http://ftpmaster.internal/ubuntu plucky/main arm64 libasyncns0 arm64 0.8-6build4 [11.2 kB]
187s Get:112 http://ftpmaster.internal/ubuntu plucky/main arm64 libflac14 arm64 1.5.0+ds-2 [180 kB]
187s Get:113 http://ftpmaster.internal/ubuntu plucky/main arm64 libsndfile1 arm64 1.2.2-2build1 [210 kB]
187s Get:114 http://ftpmaster.internal/ubuntu plucky/main arm64 libpulse0 arm64 1:17.0+dfsg1-2ubuntu1 [274 kB]
187s Get:115 http://ftpmaster.internal/ubuntu plucky/universe arm64 libsphinxbase3t64 arm64 0.8+5prealpha+1-21build1 [126 kB]
187s Get:116 http://ftpmaster.internal/ubuntu plucky/universe arm64 libpocketsphinx3 arm64 0.8.0+real5prealpha+1-15ubuntu5 [129 kB]
187s Get:117 http://ftpmaster.internal/ubuntu plucky/universe arm64 libpostproc58 arm64 7:7.1.1-1ubuntu1 [41.5 kB]
187s Get:118 http://ftpmaster.internal/ubuntu plucky/main arm64 libfftw3-double3 arm64 3.3.10-2fakesync1build1 [392 kB]
187s Get:119 http://ftpmaster.internal/ubuntu plucky/main arm64 libsamplerate0 arm64 0.2.2-4build1 [1343 kB]
187s Get:120 http://ftpmaster.internal/ubuntu plucky/universe arm64 librubberband2 arm64 3.3.0+dfsg-2build2 [120 kB]
187s Get:121 http://ftpmaster.internal/ubuntu plucky/universe arm64 libswscale8 arm64 7:7.1.1-1ubuntu1 [191 kB]
187s Get:122 http://ftpmaster.internal/ubuntu plucky/universe arm64 libvidstab1.1 arm64 1.1.0-2build1 [38.7 kB]
187s Get:123 http://ftpmaster.internal/ubuntu plucky/universe arm64 libzimg2 arm64 3.0.5+ds1-1build1 [119 kB]
187s Get:124 http://ftpmaster.internal/ubuntu plucky/universe arm64 libavfilter10 arm64 7:7.1.1-1ubuntu1 [4201 kB]
187s Get:125 http://ftpmaster.internal/ubuntu plucky/main arm64 libcaca0 arm64 0.99.beta20-5 [207 kB]
187s Get:126 http://ftpmaster.internal/ubuntu plucky/main arm64 libcdio19t64 arm64 2.2.0-1 [65.9 kB]
187s Get:127 http://ftpmaster.internal/ubuntu plucky/main arm64 libcdio-cdda2t64 arm64 10.2+2.0.2-1 [16.4 kB]
187s Get:128 http://ftpmaster.internal/ubuntu plucky/main arm64 libcdio-paranoia2t64 arm64 10.2+2.0.2-1 [15.8 kB]
187s Get:129 http://ftpmaster.internal/ubuntu plucky/universe arm64 libdc1394-25 arm64 2.2.6-4build1 [90.3 kB]
187s Get:130 http://ftpmaster.internal/ubuntu plucky/main arm64 libglvnd0 arm64 1.7.0-1build1 [60.6 kB]
187s Get:131 http://ftpmaster.internal/ubuntu plucky/main arm64 libxcb-glx0 arm64 1.17.0-2 [25.5 kB]
187s Get:132 http://ftpmaster.internal/ubuntu plucky/main arm64 libxcb-present0 arm64 1.17.0-2 [6224 B]
187s Get:133 http://ftpmaster.internal/ubuntu plucky/main arm64 libxcb-xfixes0 arm64 1.17.0-2 [10.6 kB]
187s Get:134 http://ftpmaster.internal/ubuntu plucky/main arm64 libxxf86vm1 arm64 1:1.1.4-1build4 [9130 B]
187s Get:135 http://ftpmaster.internal/ubuntu plucky/main arm64 libxcb-randr0 arm64 1.17.0-2 [18.5 kB]
187s Get:136 http://ftpmaster.internal/ubuntu plucky/main arm64 libxcb-sync1 arm64 1.17.0-2 [9688 B]
187s Get:137 http://ftpmaster.internal/ubuntu plucky/main arm64 libxshmfence1 arm64 1.3-1build5 [4938 B]
187s Get:138 http://ftpmaster.internal/ubuntu plucky/main arm64 mesa-libgallium arm64 25.0.3-1ubuntu2 [9455 kB]
188s Get:139 http://ftpmaster.internal/ubuntu plucky/main arm64 libwayland-server0 arm64 1.23.1-3 [36.1 kB]
188s Get:140 http://ftpmaster.internal/ubuntu plucky/main arm64 libgbm1 arm64 25.0.3-1ubuntu2 [33.7 kB]
188s Get:141 http://ftpmaster.internal/ubuntu plucky/main arm64 libgl1-mesa-dri arm64 25.0.3-1ubuntu2 [35.4 kB]
188s Get:142 http://ftpmaster.internal/ubuntu plucky/main arm64 libglx-mesa0 arm64 25.0.3-1ubuntu2 [151 kB]
188s Get:143 http://ftpmaster.internal/ubuntu plucky/main arm64 libglx0 arm64 1.7.0-1build1 [33.2 kB]
188s Get:144 http://ftpmaster.internal/ubuntu plucky/main arm64 libgl1 arm64 1.7.0-1build1 [106 kB]
188s Get:145 http://ftpmaster.internal/ubuntu plucky/main arm64 libiec61883-0 arm64 1.2.0-7 [24.5 kB]
188s Get:146 http://ftpmaster.internal/ubuntu plucky/main arm64 libjack-jackd2-0 arm64 1.9.22~dfsg-4 [286 kB]
188s Get:147 http://ftpmaster.internal/ubuntu plucky/universe arm64 libopenal-data all 1:1.24.2-1 [162 kB]
188s Get:148 http://ftpmaster.internal/ubuntu plucky/universe arm64 libopenal1 arm64 1:1.24.2-1 [630 kB]
188s Get:149 http://ftpmaster.internal/ubuntu plucky/main arm64 libwayland-client0 arm64 1.23.1-3 [27.0 kB]
188s Get:150 http://ftpmaster.internal/ubuntu plucky/main arm64 libdecor-0-0 arm64 0.2.2-2 [16.6 kB]
188s Get:151 http://ftpmaster.internal/ubuntu plucky/main arm64 libwayland-cursor0 arm64 1.23.1-3 [10.8 kB]
188s Get:152 http://ftpmaster.internal/ubuntu plucky/main arm64 libwayland-egl1 arm64 1.23.1-3 [6180 B]
188s Get:153 http://ftpmaster.internal/ubuntu plucky/main arm64 libxcursor1 arm64 1:1.2.3-1 [22.2 kB]
188s Get:154 http://ftpmaster.internal/ubuntu plucky/main arm64 libxi6 arm64 2:1.8.2-1 [32.4 kB]
188s Get:155 http://ftpmaster.internal/ubuntu plucky/main arm64 libxrandr2 arm64 2:1.5.4-1 [19.6 kB]
188s Get:156 http://ftpmaster.internal/ubuntu plucky/main arm64 x11-common all 1:7.7+23ubuntu4 [21.8 kB]
188s Get:157 http://ftpmaster.internal/ubuntu plucky/main arm64 libxss1 arm64 1:1.2.3-1build3 [7244 B]
188s Get:158 http://ftpmaster.internal/ubuntu plucky/main arm64 libsdl2-2.0-0 arm64 2.32.2+dfsg-2 [681 kB]
188s Get:159 http://ftpmaster.internal/ubuntu plucky/main arm64 libxcb-shape0 arm64 1.17.0-2 [6246 B]
188s Get:160 http://ftpmaster.internal/ubuntu plucky/main arm64 libxv1 arm64 2:1.0.11-1.1build1 [10.7 kB]
188s Get:161 http://ftpmaster.internal/ubuntu plucky/universe arm64 libavdevice61 arm64 7:7.1.1-1ubuntu1 [81.7 kB]
188s Get:162 http://ftpmaster.internal/ubuntu plucky/universe arm64 ffmpeg arm64 7:7.1.1-1ubuntu1 [1978 kB]
188s Get:163 http://ftpmaster.internal/ubuntu plucky/main arm64 gir1.2-freedesktop arm64 1.84.0-1 [65.0 kB]
188s Get:164 http://ftpmaster.internal/ubuntu plucky/main arm64 gir1.2-gdkpixbuf-2.0 arm64 2.42.12+dfsg-2 [9382 B]
188s Get:165 http://ftpmaster.internal/ubuntu plucky/main arm64 libgpgmepp6t64 arm64 1.24.2-1ubuntu2 [119 kB]
188s Get:166 http://ftpmaster.internal/ubuntu plucky/main arm64 libpoppler147 arm64 25.03.0-3 [1152 kB]
188s Get:167 http://ftpmaster.internal/ubuntu plucky/main arm64 libpoppler-glib8t64 arm64 25.03.0-3 [153 kB]
188s Get:168 http://ftpmaster.internal/ubuntu plucky/main arm64 gir1.2-poppler-0.18 arm64 25.03.0-3 [27.1 kB]
188s Get:169 http://ftpmaster.internal/ubuntu plucky/main arm64 gir1.2-rsvg-2.0 arm64 2.60.0+dfsg-1 [11.2 kB]
188s Get:170 http://ftpmaster.internal/ubuntu plucky-proposed/universe arm64 libimage-exiftool-perl all 13.25+dfsg-1 [5746 kB]
188s Get:171 http://ftpmaster.internal/ubuntu plucky/main arm64 python3-cairo arm64 1.27.0-2 [122 kB]
188s Get:172 http://ftpmaster.internal/ubuntu plucky/main arm64 python3-gi-cairo arm64 3.50.0-4build1 [7960 B]
188s Get:173 http://ftpmaster.internal/ubuntu plucky/universe arm64 python3-mutagen all 1.47.0-1 [125 kB]
188s Get:174 http://ftpmaster.internal/ubuntu plucky/universe arm64 mat2 all 0.13.5-1 [73.4 kB]
188s Get:175 http://ftpmaster.internal/ubuntu plucky/universe arm64 python3-iniconfig all 1.1.1-2 [6024 B]
188s Get:176 http://ftpmaster.internal/ubuntu plucky/main arm64 python3-packaging all 24.2-1 [51.5 kB]
188s Get:177 http://ftpmaster.internal/ubuntu plucky/universe arm64 python3-pluggy all 1.5.0-1 [21.0 kB]
188s Get:178 http://ftpmaster.internal/ubuntu plucky/universe arm64 python3-pytest all 8.3.5-1 [252 kB]
189s Fetched 92.4 MB in 5s (20.1 MB/s)
189s Selecting previously unselected package libaom3:arm64.
189s (Reading database ... 
(Reading database ... 5%
(Reading database ... 10%
(Reading database ... 15%
(Reading database ... 20%
(Reading database ... 25%
(Reading database ... 30%
(Reading database ... 35%
(Reading database ... 40%
(Reading database ... 45%
(Reading database ... 50%
(Reading database ... 55%
(Reading database ... 60%
(Reading database ... 65%
(Reading database ... 70%
(Reading database ... 75%
(Reading database ... 80%
(Reading database ... 85%
(Reading database ... 90%
(Reading database ... 95%
(Reading database ... 100%
(Reading database ... 117820 files and directories currently installed.)
189s Preparing to unpack .../000-libaom3_3.12.0-1_arm64.deb ...
189s Unpacking libaom3:arm64 (3.12.0-1) ...
189s Selecting previously unselected package libva2:arm64.
189s Preparing to unpack .../001-libva2_2.22.0-3ubuntu2_arm64.deb ...
189s Unpacking libva2:arm64 (2.22.0-3ubuntu2) ...
189s Selecting previously unselected package libva-drm2:arm64.
189s Preparing to unpack .../002-libva-drm2_2.22.0-3ubuntu2_arm64.deb ...
189s Unpacking libva-drm2:arm64 (2.22.0-3ubuntu2) ...
189s Selecting previously unselected package libx11-xcb1:arm64.
189s Preparing to unpack .../003-libx11-xcb1_2%3a1.8.10-2_arm64.deb ...
189s Unpacking libx11-xcb1:arm64 (2:1.8.10-2) ...
189s Selecting previously unselected package libxcb-dri3-0:arm64.
189s Preparing to unpack .../004-libxcb-dri3-0_1.17.0-2_arm64.deb ...
189s Unpacking libxcb-dri3-0:arm64 (1.17.0-2) ...
190s Selecting previously unselected package libxfixes3:arm64.
190s Preparing to unpack .../005-libxfixes3_1%3a6.0.0-2build1_arm64.deb ...
190s Unpacking libxfixes3:arm64 (1:6.0.0-2build1) ...
190s Selecting previously unselected package libva-x11-2:arm64.
190s Preparing to unpack .../006-libva-x11-2_2.22.0-3ubuntu2_arm64.deb ...
190s Unpacking libva-x11-2:arm64 (2.22.0-3ubuntu2) ...
190s Selecting previously unselected package libvdpau1:arm64.
190s Preparing to unpack .../007-libvdpau1_1.5-3_arm64.deb ...
190s Unpacking libvdpau1:arm64 (1.5-3) ...
190s Selecting previously unselected package ocl-icd-libopencl1:arm64.
190s Preparing to unpack .../008-ocl-icd-libopencl1_2.3.2-1build1_arm64.deb ...
190s Unpacking ocl-icd-libopencl1:arm64 (2.3.2-1build1) ...
190s Selecting previously unselected package libavutil59:arm64.
190s Preparing to unpack .../009-libavutil59_7%3a7.1.1-1ubuntu1_arm64.deb ...
190s Unpacking libavutil59:arm64 (7:7.1.1-1ubuntu1) ...
190s Selecting previously unselected package fonts-dejavu-mono.
190s Preparing to unpack .../010-fonts-dejavu-mono_2.37-8_all.deb ...
190s Unpacking fonts-dejavu-mono (2.37-8) ...
190s Selecting previously unselected package fonts-dejavu-core.
190s Preparing to unpack .../011-fonts-dejavu-core_2.37-8_all.deb ...
190s Unpacking fonts-dejavu-core (2.37-8) ...
190s Selecting previously unselected package fontconfig-config.
190s Preparing to unpack .../012-fontconfig-config_2.15.0-2.2ubuntu1_arm64.deb ...
190s Unpacking fontconfig-config (2.15.0-2.2ubuntu1) ...
190s Selecting previously unselected package libfontconfig1:arm64.
190s Preparing to unpack .../013-libfontconfig1_2.15.0-2.2ubuntu1_arm64.deb ...
190s Unpacking libfontconfig1:arm64 (2.15.0-2.2ubuntu1) ...
190s Selecting previously unselected package libpixman-1-0:arm64.
190s Preparing to unpack .../014-libpixman-1-0_0.44.0-3_arm64.deb ...
190s Unpacking libpixman-1-0:arm64 (0.44.0-3) ...
190s Selecting previously unselected package libxcb-render0:arm64.
190s Preparing to unpack .../015-libxcb-render0_1.17.0-2_arm64.deb ...
190s Unpacking libxcb-render0:arm64 (1.17.0-2) ...
190s Selecting previously unselected package libxcb-shm0:arm64.
190s Preparing to unpack .../016-libxcb-shm0_1.17.0-2_arm64.deb ...
190s Unpacking libxcb-shm0:arm64 (1.17.0-2) ...
190s Selecting previously unselected package libxrender1:arm64.
190s Preparing to unpack .../017-libxrender1_1%3a0.9.10-1.1build1_arm64.deb ...
190s Unpacking libxrender1:arm64 (1:0.9.10-1.1build1) ...
190s Selecting previously unselected package libcairo2:arm64.
190s Preparing to unpack .../018-libcairo2_1.18.4-1_arm64.deb ...
190s Unpacking libcairo2:arm64 (1.18.4-1) ...
190s Selecting previously unselected package libcodec2-1.2:arm64.
190s Preparing to unpack .../019-libcodec2-1.2_1.2.0-3_arm64.deb ...
190s Unpacking libcodec2-1.2:arm64 (1.2.0-3) ...
191s Selecting previously unselected package libdav1d7:arm64.
191s Preparing to unpack .../020-libdav1d7_1.5.1-1_arm64.deb ...
191s Unpacking libdav1d7:arm64 (1.5.1-1) ...
191s Selecting previously unselected package libgsm1:arm64.
191s Preparing to unpack .../021-libgsm1_1.0.22-1build1_arm64.deb ...
191s Unpacking libgsm1:arm64 (1.0.22-1build1) ...
191s Selecting previously unselected package libhwy1t64:arm64.
191s Preparing to unpack .../022-libhwy1t64_1.2.0-3ubuntu3_arm64.deb ...
191s Unpacking libhwy1t64:arm64 (1.2.0-3ubuntu3) ...
191s Selecting previously unselected package liblcms2-2:arm64.
191s Preparing to unpack .../023-liblcms2-2_2.16-2_arm64.deb ...
191s Unpacking liblcms2-2:arm64 (2.16-2) ...
191s Selecting previously unselected package libjxl0.11:arm64.
191s Preparing to unpack .../024-libjxl0.11_0.11.1-4_arm64.deb ...
191s Unpacking libjxl0.11:arm64 (0.11.1-4) ...
191s Selecting previously unselected package libmp3lame0:arm64.
191s Preparing to unpack .../025-libmp3lame0_3.100-6build1_arm64.deb ...
191s Unpacking libmp3lame0:arm64 (3.100-6build1) ...
191s Selecting previously unselected package libopenjp2-7:arm64.
191s Preparing to unpack .../026-libopenjp2-7_2.5.3-2_arm64.deb ...
191s Unpacking libopenjp2-7:arm64 (2.5.3-2) ...
191s Selecting previously unselected package libopus0:arm64.
191s Preparing to unpack .../027-libopus0_1.5.2-2_arm64.deb ...
191s Unpacking libopus0:arm64 (1.5.2-2) ...
191s Selecting previously unselected package librav1e0.7:arm64.
191s Preparing to unpack .../028-librav1e0.7_0.7.1-9_arm64.deb ...
191s Unpacking librav1e0.7:arm64 (0.7.1-9) ...
191s Selecting previously unselected package libcairo-gobject2:arm64.
191s Preparing to unpack .../029-libcairo-gobject2_1.18.4-1_arm64.deb ...
191s Unpacking libcairo-gobject2:arm64 (1.18.4-1) ...
191s Selecting previously unselected package libgdk-pixbuf2.0-common.
191s Preparing to unpack .../030-libgdk-pixbuf2.0-common_2.42.12+dfsg-2_all.deb ...
191s Unpacking libgdk-pixbuf2.0-common (2.42.12+dfsg-2) ...
191s Selecting previously unselected package libjpeg-turbo8:arm64.
191s Preparing to unpack .../031-libjpeg-turbo8_2.1.5-3ubuntu2_arm64.deb ...
191s Unpacking libjpeg-turbo8:arm64 (2.1.5-3ubuntu2) ...
191s Selecting previously unselected package libjpeg8:arm64.
191s Preparing to unpack .../032-libjpeg8_8c-2ubuntu11_arm64.deb ...
191s Unpacking libjpeg8:arm64 (8c-2ubuntu11) ...
191s Selecting previously unselected package libdeflate0:arm64.
191s Preparing to unpack .../033-libdeflate0_1.23-1_arm64.deb ...
191s Unpacking libdeflate0:arm64 (1.23-1) ...
191s Selecting previously unselected package libjbig0:arm64.
191s Preparing to unpack .../034-libjbig0_2.1-6.1ubuntu2_arm64.deb ...
191s Unpacking libjbig0:arm64 (2.1-6.1ubuntu2) ...
191s Selecting previously unselected package liblerc4:arm64.
191s Preparing to unpack .../035-liblerc4_4.0.0+ds-5ubuntu1_arm64.deb ...
191s Unpacking liblerc4:arm64 (4.0.0+ds-5ubuntu1) ...
191s Selecting previously unselected package libsharpyuv0:arm64.
191s Preparing to unpack .../036-libsharpyuv0_1.5.0-0.1_arm64.deb ...
191s Unpacking libsharpyuv0:arm64 (1.5.0-0.1) ...
191s Selecting previously unselected package libwebp7:arm64.
191s Preparing to unpack .../037-libwebp7_1.5.0-0.1_arm64.deb ...
191s Unpacking libwebp7:arm64 (1.5.0-0.1) ...
191s Selecting previously unselected package libtiff6:arm64.
191s Preparing to unpack .../038-libtiff6_4.5.1+git230720-4ubuntu4_arm64.deb ...
191s Unpacking libtiff6:arm64 (4.5.1+git230720-4ubuntu4) ...
191s Selecting previously unselected package libgdk-pixbuf-2.0-0:arm64.
192s Preparing to unpack .../039-libgdk-pixbuf-2.0-0_2.42.12+dfsg-2_arm64.deb ...
192s Unpacking libgdk-pixbuf-2.0-0:arm64 (2.42.12+dfsg-2) ...
192s Selecting previously unselected package fontconfig.
192s Preparing to unpack .../040-fontconfig_2.15.0-2.2ubuntu1_arm64.deb ...
192s Unpacking fontconfig (2.15.0-2.2ubuntu1) ...
192s Selecting previously unselected package libgraphite2-3:arm64.
192s Preparing to unpack .../041-libgraphite2-3_1.3.14-2ubuntu1_arm64.deb ...
192s Unpacking libgraphite2-3:arm64 (1.3.14-2ubuntu1) ...
192s Selecting previously unselected package libharfbuzz0b:arm64.
192s Preparing to unpack .../042-libharfbuzz0b_10.2.0-1_arm64.deb ...
192s Unpacking libharfbuzz0b:arm64 (10.2.0-1) ...
192s Selecting previously unselected package libthai-data.
192s Preparing to unpack .../043-libthai-data_0.1.29-2build1_all.deb ...
192s Unpacking libthai-data (0.1.29-2build1) ...
192s Selecting previously unselected package libdatrie1:arm64.
192s Preparing to unpack .../044-libdatrie1_0.2.13-3build1_arm64.deb ...
192s Unpacking libdatrie1:arm64 (0.2.13-3build1) ...
192s Selecting previously unselected package libthai0:arm64.
192s Preparing to unpack .../045-libthai0_0.1.29-2build1_arm64.deb ...
192s Unpacking libthai0:arm64 (0.1.29-2build1) ...
192s Selecting previously unselected package libpango-1.0-0:arm64.
192s Preparing to unpack .../046-libpango-1.0-0_1.56.3-1_arm64.deb ...
192s Unpacking libpango-1.0-0:arm64 (1.56.3-1) ...
192s Selecting previously unselected package libpangoft2-1.0-0:arm64.
192s Preparing to unpack .../047-libpangoft2-1.0-0_1.56.3-1_arm64.deb ...
192s Unpacking libpangoft2-1.0-0:arm64 (1.56.3-1) ...
192s Selecting previously unselected package libpangocairo-1.0-0:arm64.
192s Preparing to unpack .../048-libpangocairo-1.0-0_1.56.3-1_arm64.deb ...
192s Unpacking libpangocairo-1.0-0:arm64 (1.56.3-1) ...
192s Selecting previously unselected package librsvg2-2:arm64.
192s Preparing to unpack .../049-librsvg2-2_2.60.0+dfsg-1_arm64.deb ...
192s Unpacking librsvg2-2:arm64 (2.60.0+dfsg-1) ...
192s Selecting previously unselected package libshine3:arm64.
192s Preparing to unpack .../050-libshine3_3.1.1-2build1_arm64.deb ...
192s Unpacking libshine3:arm64 (3.1.1-2build1) ...
192s Selecting previously unselected package libsnappy1v5:arm64.
192s Preparing to unpack .../051-libsnappy1v5_1.2.1-1_arm64.deb ...
192s Unpacking libsnappy1v5:arm64 (1.2.1-1) ...
192s Selecting previously unselected package libspeex1:arm64.
192s Preparing to unpack .../052-libspeex1_1.2.1-3_arm64.deb ...
192s Unpacking libspeex1:arm64 (1.2.1-3) ...
192s Selecting previously unselected package libsvtav1enc2:arm64.
192s Preparing to unpack .../053-libsvtav1enc2_2.3.0+dfsg-1_arm64.deb ...
192s Unpacking libsvtav1enc2:arm64 (2.3.0+dfsg-1) ...
192s Selecting previously unselected package libgomp1:arm64.
192s Preparing to unpack .../054-libgomp1_15-20250404-0ubuntu1_arm64.deb ...
192s Unpacking libgomp1:arm64 (15-20250404-0ubuntu1) ...
192s Selecting previously unselected package libsoxr0:arm64.
192s Preparing to unpack .../055-libsoxr0_0.1.3-4build3_arm64.deb ...
192s Unpacking libsoxr0:arm64 (0.1.3-4build3) ...
192s Selecting previously unselected package libswresample5:arm64.
192s Preparing to unpack .../056-libswresample5_7%3a7.1.1-1ubuntu1_arm64.deb ...
192s Unpacking libswresample5:arm64 (7:7.1.1-1ubuntu1) ...
192s Selecting previously unselected package libtheoradec1:arm64.
192s Preparing to unpack .../057-libtheoradec1_1.2.0~alpha1+dfsg-6_arm64.deb ...
192s Unpacking libtheoradec1:arm64 (1.2.0~alpha1+dfsg-6) ...
192s Selecting previously unselected package libogg0:arm64.
192s Preparing to unpack .../058-libogg0_1.3.5-3build1_arm64.deb ...
192s Unpacking libogg0:arm64 (1.3.5-3build1) ...
192s Selecting previously unselected package libtheoraenc1:arm64.
192s Preparing to unpack .../059-libtheoraenc1_1.2.0~alpha1+dfsg-6_arm64.deb ...
192s Unpacking libtheoraenc1:arm64 (1.2.0~alpha1+dfsg-6) ...
192s Selecting previously unselected package libtwolame0:arm64.
193s Preparing to unpack .../060-libtwolame0_0.4.0-2build3_arm64.deb ...
193s Unpacking libtwolame0:arm64 (0.4.0-2build3) ...
193s Selecting previously unselected package libvorbis0a:arm64.
193s Preparing to unpack .../061-libvorbis0a_1.3.7-2_arm64.deb ...
193s Unpacking libvorbis0a:arm64 (1.3.7-2) ...
193s Selecting previously unselected package libvorbisenc2:arm64.
193s Preparing to unpack .../062-libvorbisenc2_1.3.7-2_arm64.deb ...
193s Unpacking libvorbisenc2:arm64 (1.3.7-2) ...
193s Selecting previously unselected package libvpx9:arm64.
193s Preparing to unpack .../063-libvpx9_1.15.0-2_arm64.deb ...
193s Unpacking libvpx9:arm64 (1.15.0-2) ...
193s Selecting previously unselected package libwebpmux3:arm64.
193s Preparing to unpack .../064-libwebpmux3_1.5.0-0.1_arm64.deb ...
193s Unpacking libwebpmux3:arm64 (1.5.0-0.1) ...
193s Selecting previously unselected package libx264-164:arm64.
193s Preparing to unpack .../065-libx264-164_2%3a0.164.3108+git31e19f9-2build2_arm64.deb ...
193s Unpacking libx264-164:arm64 (2:0.164.3108+git31e19f9-2build2) ...
193s Selecting previously unselected package libx265-215:arm64.
193s Preparing to unpack .../066-libx265-215_4.1-2_arm64.deb ...
193s Unpacking libx265-215:arm64 (4.1-2) ...
193s Selecting previously unselected package libxvidcore4:arm64.
193s Preparing to unpack .../067-libxvidcore4_2%3a1.3.7-1build1_arm64.deb ...
193s Unpacking libxvidcore4:arm64 (2:1.3.7-1build1) ...
193s Selecting previously unselected package libzvbi-common.
193s Preparing to unpack .../068-libzvbi-common_0.2.44-1ubuntu1_all.deb ...
193s Unpacking libzvbi-common (0.2.44-1ubuntu1) ...
193s Selecting previously unselected package libzvbi0t64:arm64.
193s Preparing to unpack .../069-libzvbi0t64_0.2.44-1ubuntu1_arm64.deb ...
193s Unpacking libzvbi0t64:arm64 (0.2.44-1ubuntu1) ...
193s Selecting previously unselected package libavcodec61:arm64.
193s Preparing to unpack .../070-libavcodec61_7%3a7.1.1-1ubuntu1_arm64.deb ...
193s Unpacking libavcodec61:arm64 (7:7.1.1-1ubuntu1) ...
193s Selecting previously unselected package libasound2-data.
193s Preparing to unpack .../071-libasound2-data_1.2.13-1build1_all.deb ...
193s Unpacking libasound2-data (1.2.13-1build1) ...
193s Selecting previously unselected package libasound2t64:arm64.
193s Preparing to unpack .../072-libasound2t64_1.2.13-1build1_arm64.deb ...
193s Unpacking libasound2t64:arm64 (1.2.13-1build1) ...
193s Selecting previously unselected package libraw1394-11:arm64.
193s Preparing to unpack .../073-libraw1394-11_2.1.2-2build3_arm64.deb ...
193s Unpacking libraw1394-11:arm64 (2.1.2-2build3) ...
193s Selecting previously unselected package libavc1394-0:arm64.
193s Preparing to unpack .../074-libavc1394-0_0.5.4-5build3_arm64.deb ...
193s Unpacking libavc1394-0:arm64 (0.5.4-5build3) ...
193s Selecting previously unselected package libunibreak6:arm64.
193s Preparing to unpack .../075-libunibreak6_6.1-2_arm64.deb ...
193s Unpacking libunibreak6:arm64 (6.1-2) ...
193s Selecting previously unselected package libass9:arm64.
194s Preparing to unpack .../076-libass9_1%3a0.17.3-1_arm64.deb ...
194s Unpacking libass9:arm64 (1:0.17.3-1) ...
194s Selecting previously unselected package libudfread0:arm64.
194s Preparing to unpack .../077-libudfread0_1.1.2-1build1_arm64.deb ...
194s Unpacking libudfread0:arm64 (1.1.2-1build1) ...
194s Selecting previously unselected package libbluray2:arm64.
194s Preparing to unpack .../078-libbluray2_1%3a1.3.4-1build1_arm64.deb ...
194s Unpacking libbluray2:arm64 (1:1.3.4-1build1) ...
194s Selecting previously unselected package libchromaprint1:arm64.
194s Preparing to unpack .../079-libchromaprint1_1.5.1-7_arm64.deb ...
194s Unpacking libchromaprint1:arm64 (1.5.1-7) ...
194s Selecting previously unselected package libdvdread8t64:arm64.
194s Preparing to unpack .../080-libdvdread8t64_6.1.3-2_arm64.deb ...
194s Unpacking libdvdread8t64:arm64 (6.1.3-2) ...
194s Selecting previously unselected package libdvdnav4:arm64.
194s Preparing to unpack .../081-libdvdnav4_6.1.1-3build1_arm64.deb ...
194s Unpacking libdvdnav4:arm64 (6.1.1-3build1) ...
194s Selecting previously unselected package libgme0:arm64.
194s Preparing to unpack .../082-libgme0_0.6.3-7build1_arm64.deb ...
194s Unpacking libgme0:arm64 (0.6.3-7build1) ...
194s Selecting previously unselected package libmpg123-0t64:arm64.
194s Preparing to unpack .../083-libmpg123-0t64_1.32.10-1_arm64.deb ...
194s Unpacking libmpg123-0t64:arm64 (1.32.10-1) ...
194s Selecting previously unselected package libvorbisfile3:arm64.
194s Preparing to unpack .../084-libvorbisfile3_1.3.7-2_arm64.deb ...
194s Unpacking libvorbisfile3:arm64 (1.3.7-2) ...
194s Selecting previously unselected package libopenmpt0t64:arm64.
194s Preparing to unpack .../085-libopenmpt0t64_0.7.13-1build1_arm64.deb ...
194s Unpacking libopenmpt0t64:arm64 (0.7.13-1build1) ...
194s Selecting previously unselected package librabbitmq4:arm64.
194s Preparing to unpack .../086-librabbitmq4_0.15.0-1_arm64.deb ...
194s Unpacking librabbitmq4:arm64 (0.15.0-1) ...
194s Selecting previously unselected package libcjson1:arm64.
194s Preparing to unpack .../087-libcjson1_1.7.18-3_arm64.deb ...
194s Unpacking libcjson1:arm64 (1.7.18-3) ...
194s Selecting previously unselected package libmbedcrypto16:arm64.
194s Preparing to unpack .../088-libmbedcrypto16_3.6.2-3ubuntu1_arm64.deb ...
194s Unpacking libmbedcrypto16:arm64 (3.6.2-3ubuntu1) ...
194s Selecting previously unselected package librist4:arm64.
194s Preparing to unpack .../089-librist4_0.2.11+dfsg-1_arm64.deb ...
194s Unpacking librist4:arm64 (0.2.11+dfsg-1) ...
194s Selecting previously unselected package libsrt1.5-gnutls:arm64.
194s Preparing to unpack .../090-libsrt1.5-gnutls_1.5.4-1_arm64.deb ...
194s Unpacking libsrt1.5-gnutls:arm64 (1.5.4-1) ...
194s Selecting previously unselected package libssh-4:arm64.
195s Preparing to unpack .../091-libssh-4_0.11.1-1_arm64.deb ...
195s Unpacking libssh-4:arm64 (0.11.1-1) ...
195s Selecting previously unselected package libnorm1t64:arm64.
195s Preparing to unpack .../092-libnorm1t64_1.5.9+dfsg-3.1build1_arm64.deb ...
195s Unpacking libnorm1t64:arm64 (1.5.9+dfsg-3.1build1) ...
195s Selecting previously unselected package libpgm-5.3-0t64:arm64.
195s Preparing to unpack .../093-libpgm-5.3-0t64_5.3.128~dfsg-2.1build1_arm64.deb ...
195s Unpacking libpgm-5.3-0t64:arm64 (5.3.128~dfsg-2.1build1) ...
195s Selecting previously unselected package libsodium23:arm64.
195s Preparing to unpack .../094-libsodium23_1.0.18-1build3_arm64.deb ...
195s Unpacking libsodium23:arm64 (1.0.18-1build3) ...
195s Selecting previously unselected package libzmq5:arm64.
195s Preparing to unpack .../095-libzmq5_4.3.5-1build2_arm64.deb ...
195s Unpacking libzmq5:arm64 (4.3.5-1build2) ...
195s Selecting previously unselected package libavformat61:arm64.
195s Preparing to unpack .../096-libavformat61_7%3a7.1.1-1ubuntu1_arm64.deb ...
195s Unpacking libavformat61:arm64 (7:7.1.1-1ubuntu1) ...
195s Selecting previously unselected package libbs2b0:arm64.
195s Preparing to unpack .../097-libbs2b0_3.1.0+dfsg-8_arm64.deb ...
195s Unpacking libbs2b0:arm64 (3.1.0+dfsg-8) ...
195s Selecting previously unselected package libflite1:arm64.
195s Preparing to unpack .../098-libflite1_2.2-7_arm64.deb ...
195s Unpacking libflite1:arm64 (2.2-7) ...
195s Selecting previously unselected package libserd-0-0:arm64.
195s Preparing to unpack .../099-libserd-0-0_0.32.4-1_arm64.deb ...
195s Unpacking libserd-0-0:arm64 (0.32.4-1) ...
195s Selecting previously unselected package libzix-0-0:arm64.
195s Preparing to unpack .../100-libzix-0-0_0.6.2-1_arm64.deb ...
195s Unpacking libzix-0-0:arm64 (0.6.2-1) ...
195s Selecting previously unselected package libsord-0-0:arm64.
195s Preparing to unpack .../101-libsord-0-0_0.16.18-1_arm64.deb ...
195s Unpacking libsord-0-0:arm64 (0.16.18-1) ...
195s Selecting previously unselected package libsratom-0-0:arm64.
195s Preparing to unpack .../102-libsratom-0-0_0.6.18-1_arm64.deb ...
195s Unpacking libsratom-0-0:arm64 (0.6.18-1) ...
195s Selecting previously unselected package liblilv-0-0:arm64.
195s Preparing to unpack .../103-liblilv-0-0_0.24.26-1_arm64.deb ...
195s Unpacking liblilv-0-0:arm64 (0.24.26-1) ...
195s Selecting previously unselected package libmysofa1:arm64.
195s Preparing to unpack .../104-libmysofa1_1.3.3+dfsg-1ubuntu1_arm64.deb ...
195s Unpacking libmysofa1:arm64 (1.3.3+dfsg-1ubuntu1) ...
195s Selecting previously unselected package libvulkan1:arm64.
195s Preparing to unpack .../105-libvulkan1_1.4.304.0-1_arm64.deb ...
195s Unpacking libvulkan1:arm64 (1.4.304.0-1) ...
195s Selecting previously unselected package libplacebo349:arm64.
195s Preparing to unpack .../106-libplacebo349_7.349.0-3_arm64.deb ...
195s Unpacking libplacebo349:arm64 (7.349.0-3) ...
195s Selecting previously unselected package libblas3:arm64.
196s Preparing to unpack .../107-libblas3_3.12.1-2_arm64.deb ...
196s Unpacking libblas3:arm64 (3.12.1-2) ...
196s Selecting previously unselected package libgfortran5:arm64.
196s Preparing to unpack .../108-libgfortran5_15-20250404-0ubuntu1_arm64.deb ...
196s Unpacking libgfortran5:arm64 (15-20250404-0ubuntu1) ...
196s Selecting previously unselected package liblapack3:arm64.
196s Preparing to unpack .../109-liblapack3_3.12.1-2_arm64.deb ...
196s Unpacking liblapack3:arm64 (3.12.1-2) ...
196s Selecting previously unselected package libasyncns0:arm64.
196s Preparing to unpack .../110-libasyncns0_0.8-6build4_arm64.deb ...
196s Unpacking libasyncns0:arm64 (0.8-6build4) ...
196s Selecting previously unselected package libflac14:arm64.
196s Preparing to unpack .../111-libflac14_1.5.0+ds-2_arm64.deb ...
196s Unpacking libflac14:arm64 (1.5.0+ds-2) ...
196s Selecting previously unselected package libsndfile1:arm64.
196s Preparing to unpack .../112-libsndfile1_1.2.2-2build1_arm64.deb ...
196s Unpacking libsndfile1:arm64 (1.2.2-2build1) ...
196s Selecting previously unselected package libpulse0:arm64.
196s Preparing to unpack .../113-libpulse0_1%3a17.0+dfsg1-2ubuntu1_arm64.deb ...
196s Unpacking libpulse0:arm64 (1:17.0+dfsg1-2ubuntu1) ...
196s Selecting previously unselected package libsphinxbase3t64:arm64.
196s Preparing to unpack .../114-libsphinxbase3t64_0.8+5prealpha+1-21build1_arm64.deb ...
196s Unpacking libsphinxbase3t64:arm64 (0.8+5prealpha+1-21build1) ...
196s Selecting previously unselected package libpocketsphinx3:arm64.
196s Preparing to unpack .../115-libpocketsphinx3_0.8.0+real5prealpha+1-15ubuntu5_arm64.deb ...
196s Unpacking libpocketsphinx3:arm64 (0.8.0+real5prealpha+1-15ubuntu5) ...
196s Selecting previously unselected package libpostproc58:arm64.
196s Preparing to unpack .../116-libpostproc58_7%3a7.1.1-1ubuntu1_arm64.deb ...
196s Unpacking libpostproc58:arm64 (7:7.1.1-1ubuntu1) ...
196s Selecting previously unselected package libfftw3-double3:arm64.
196s Preparing to unpack .../117-libfftw3-double3_3.3.10-2fakesync1build1_arm64.deb ...
196s Unpacking libfftw3-double3:arm64 (3.3.10-2fakesync1build1) ...
196s Selecting previously unselected package libsamplerate0:arm64.
196s Preparing to unpack .../118-libsamplerate0_0.2.2-4build1_arm64.deb ...
196s Unpacking libsamplerate0:arm64 (0.2.2-4build1) ...
196s Selecting previously unselected package librubberband2:arm64.
196s Preparing to unpack .../119-librubberband2_3.3.0+dfsg-2build2_arm64.deb ...
196s Unpacking librubberband2:arm64 (3.3.0+dfsg-2build2) ...
196s Selecting previously unselected package libswscale8:arm64.
196s Preparing to unpack .../120-libswscale8_7%3a7.1.1-1ubuntu1_arm64.deb ...
196s Unpacking libswscale8:arm64 (7:7.1.1-1ubuntu1) ...
196s Selecting previously unselected package libvidstab1.1:arm64.
196s Preparing to unpack .../121-libvidstab1.1_1.1.0-2build1_arm64.deb ...
196s Unpacking libvidstab1.1:arm64 (1.1.0-2build1) ...
196s Selecting previously unselected package libzimg2:arm64.
196s Preparing to unpack .../122-libzimg2_3.0.5+ds1-1build1_arm64.deb ...
196s Unpacking libzimg2:arm64 (3.0.5+ds1-1build1) ...
196s Selecting previously unselected package libavfilter10:arm64.
196s Preparing to unpack .../123-libavfilter10_7%3a7.1.1-1ubuntu1_arm64.deb ...
196s Unpacking libavfilter10:arm64 (7:7.1.1-1ubuntu1) ...
196s Selecting previously unselected package libcaca0:arm64.
196s Preparing to unpack .../124-libcaca0_0.99.beta20-5_arm64.deb ...
196s Unpacking libcaca0:arm64 (0.99.beta20-5) ...
197s Selecting previously unselected package libcdio19t64:arm64.
197s Preparing to unpack .../125-libcdio19t64_2.2.0-1_arm64.deb ...
197s Unpacking libcdio19t64:arm64 (2.2.0-1) ...
197s Selecting previously unselected package libcdio-cdda2t64:arm64.
197s Preparing to unpack .../126-libcdio-cdda2t64_10.2+2.0.2-1_arm64.deb ...
197s Unpacking libcdio-cdda2t64:arm64 (10.2+2.0.2-1) ...
197s Selecting previously unselected package libcdio-paranoia2t64:arm64.
197s Preparing to unpack .../127-libcdio-paranoia2t64_10.2+2.0.2-1_arm64.deb ...
197s Unpacking libcdio-paranoia2t64:arm64 (10.2+2.0.2-1) ...
197s Selecting previously unselected package libdc1394-25:arm64.
197s Preparing to unpack .../128-libdc1394-25_2.2.6-4build1_arm64.deb ...
197s Unpacking libdc1394-25:arm64 (2.2.6-4build1) ...
197s Selecting previously unselected package libglvnd0:arm64.
197s Preparing to unpack .../129-libglvnd0_1.7.0-1build1_arm64.deb ...
197s Unpacking libglvnd0:arm64 (1.7.0-1build1) ...
197s Selecting previously unselected package libxcb-glx0:arm64.
197s Preparing to unpack .../130-libxcb-glx0_1.17.0-2_arm64.deb ...
197s Unpacking libxcb-glx0:arm64 (1.17.0-2) ...
197s Selecting previously unselected package libxcb-present0:arm64.
197s Preparing to unpack .../131-libxcb-present0_1.17.0-2_arm64.deb ...
197s Unpacking libxcb-present0:arm64 (1.17.0-2) ...
197s Selecting previously unselected package libxcb-xfixes0:arm64.
197s Preparing to unpack .../132-libxcb-xfixes0_1.17.0-2_arm64.deb ...
197s Unpacking libxcb-xfixes0:arm64 (1.17.0-2) ...
197s Selecting previously unselected package libxxf86vm1:arm64.
197s Preparing to unpack .../133-libxxf86vm1_1%3a1.1.4-1build4_arm64.deb ...
197s Unpacking libxxf86vm1:arm64 (1:1.1.4-1build4) ...
197s Selecting previously unselected package libxcb-randr0:arm64.
197s Preparing to unpack .../134-libxcb-randr0_1.17.0-2_arm64.deb ...
197s Unpacking libxcb-randr0:arm64 (1.17.0-2) ...
197s Selecting previously unselected package libxcb-sync1:arm64.
197s Preparing to unpack .../135-libxcb-sync1_1.17.0-2_arm64.deb ...
197s Unpacking libxcb-sync1:arm64 (1.17.0-2) ...
197s Selecting previously unselected package libxshmfence1:arm64.
197s Preparing to unpack .../136-libxshmfence1_1.3-1build5_arm64.deb ...
197s Unpacking libxshmfence1:arm64 (1.3-1build5) ...
197s Selecting previously unselected package mesa-libgallium:arm64.
197s Preparing to unpack .../137-mesa-libgallium_25.0.3-1ubuntu2_arm64.deb ...
197s Unpacking mesa-libgallium:arm64 (25.0.3-1ubuntu2) ...
197s Selecting previously unselected package libwayland-server0:arm64.
197s Preparing to unpack .../138-libwayland-server0_1.23.1-3_arm64.deb ...
197s Unpacking libwayland-server0:arm64 (1.23.1-3) ...
197s Selecting previously unselected package libgbm1:arm64.
197s Preparing to unpack .../139-libgbm1_25.0.3-1ubuntu2_arm64.deb ...
197s Unpacking libgbm1:arm64 (25.0.3-1ubuntu2) ...
197s Selecting previously unselected package libgl1-mesa-dri:arm64.
197s Preparing to unpack .../140-libgl1-mesa-dri_25.0.3-1ubuntu2_arm64.deb ...
197s Unpacking libgl1-mesa-dri:arm64 (25.0.3-1ubuntu2) ...
198s Selecting previously unselected package libglx-mesa0:arm64.
198s Preparing to unpack .../141-libglx-mesa0_25.0.3-1ubuntu2_arm64.deb ...
198s Unpacking libglx-mesa0:arm64 (25.0.3-1ubuntu2) ...
198s Selecting previously unselected package libglx0:arm64.
198s Preparing to unpack .../142-libglx0_1.7.0-1build1_arm64.deb ...
198s Unpacking libglx0:arm64 (1.7.0-1build1) ...
198s Selecting previously unselected package libgl1:arm64.
198s Preparing to unpack .../143-libgl1_1.7.0-1build1_arm64.deb ...
198s Unpacking libgl1:arm64 (1.7.0-1build1) ...
198s Selecting previously unselected package libiec61883-0:arm64.
198s Preparing to unpack .../144-libiec61883-0_1.2.0-7_arm64.deb ...
198s Unpacking libiec61883-0:arm64 (1.2.0-7) ...
198s Selecting previously unselected package libjack-jackd2-0:arm64.
198s Preparing to unpack .../145-libjack-jackd2-0_1.9.22~dfsg-4_arm64.deb ...
198s Unpacking libjack-jackd2-0:arm64 (1.9.22~dfsg-4) ...
198s Selecting previously unselected package libopenal-data.
198s Preparing to unpack .../146-libopenal-data_1%3a1.24.2-1_all.deb ...
198s Unpacking libopenal-data (1:1.24.2-1) ...
198s Selecting previously unselected package libopenal1:arm64.
198s Preparing to unpack .../147-libopenal1_1%3a1.24.2-1_arm64.deb ...
198s Unpacking libopenal1:arm64 (1:1.24.2-1) ...
198s Selecting previously unselected package libwayland-client0:arm64.
198s Preparing to unpack .../148-libwayland-client0_1.23.1-3_arm64.deb ...
198s Unpacking libwayland-client0:arm64 (1.23.1-3) ...
198s Selecting previously unselected package libdecor-0-0:arm64.
198s Preparing to unpack .../149-libdecor-0-0_0.2.2-2_arm64.deb ...
198s Unpacking libdecor-0-0:arm64 (0.2.2-2) ...
198s Selecting previously unselected package libwayland-cursor0:arm64.
198s Preparing to unpack .../150-libwayland-cursor0_1.23.1-3_arm64.deb ...
198s Unpacking libwayland-cursor0:arm64 (1.23.1-3) ...
198s Selecting previously unselected package libwayland-egl1:arm64.
198s Preparing to unpack .../151-libwayland-egl1_1.23.1-3_arm64.deb ...
198s Unpacking libwayland-egl1:arm64 (1.23.1-3) ...
198s Selecting previously unselected package libxcursor1:arm64.
198s Preparing to unpack .../152-libxcursor1_1%3a1.2.3-1_arm64.deb ...
198s Unpacking libxcursor1:arm64 (1:1.2.3-1) ...
198s Selecting previously unselected package libxi6:arm64.
198s Preparing to unpack .../153-libxi6_2%3a1.8.2-1_arm64.deb ...
198s Unpacking libxi6:arm64 (2:1.8.2-1) ...
198s Selecting previously unselected package libxrandr2:arm64.
198s Preparing to unpack .../154-libxrandr2_2%3a1.5.4-1_arm64.deb ...
198s Unpacking libxrandr2:arm64 (2:1.5.4-1) ...
198s Selecting previously unselected package x11-common.
198s Preparing to unpack .../155-x11-common_1%3a7.7+23ubuntu4_all.deb ...
198s Unpacking x11-common (1:7.7+23ubuntu4) ...
198s Selecting previously unselected package libxss1:arm64.
198s Preparing to unpack .../156-libxss1_1%3a1.2.3-1build3_arm64.deb ...
198s Unpacking libxss1:arm64 (1:1.2.3-1build3) ...
198s Selecting previously unselected package libsdl2-2.0-0:arm64.
198s Preparing to unpack .../157-libsdl2-2.0-0_2.32.2+dfsg-2_arm64.deb ...
198s Unpacking libsdl2-2.0-0:arm64 (2.32.2+dfsg-2) ...
198s Selecting previously unselected package libxcb-shape0:arm64.
198s Preparing to unpack .../158-libxcb-shape0_1.17.0-2_arm64.deb ...
198s Unpacking libxcb-shape0:arm64 (1.17.0-2) ...
198s Selecting previously unselected package libxv1:arm64.
198s Preparing to unpack .../159-libxv1_2%3a1.0.11-1.1build1_arm64.deb ...
198s Unpacking libxv1:arm64 (2:1.0.11-1.1build1) ...
198s Selecting previously unselected package libavdevice61:arm64.
198s Preparing to unpack .../160-libavdevice61_7%3a7.1.1-1ubuntu1_arm64.deb ...
198s Unpacking libavdevice61:arm64 (7:7.1.1-1ubuntu1) ...
198s Selecting previously unselected package ffmpeg.
198s Preparing to unpack .../161-ffmpeg_7%3a7.1.1-1ubuntu1_arm64.deb ...
198s Unpacking ffmpeg (7:7.1.1-1ubuntu1) ...
198s Selecting previously unselected package gir1.2-freedesktop:arm64.
198s Preparing to unpack .../162-gir1.2-freedesktop_1.84.0-1_arm64.deb ...
198s Unpacking gir1.2-freedesktop:arm64 (1.84.0-1) ...
198s Selecting previously unselected package gir1.2-gdkpixbuf-2.0:arm64.
199s Preparing to unpack .../163-gir1.2-gdkpixbuf-2.0_2.42.12+dfsg-2_arm64.deb ...
199s Unpacking gir1.2-gdkpixbuf-2.0:arm64 (2.42.12+dfsg-2) ...
199s Selecting previously unselected package libgpgmepp6t64:arm64.
199s Preparing to unpack .../164-libgpgmepp6t64_1.24.2-1ubuntu2_arm64.deb ...
199s Unpacking libgpgmepp6t64:arm64 (1.24.2-1ubuntu2) ...
199s Selecting previously unselected package libpoppler147:arm64.
199s Preparing to unpack .../165-libpoppler147_25.03.0-3_arm64.deb ...
199s Unpacking libpoppler147:arm64 (25.03.0-3) ...
199s Selecting previously unselected package libpoppler-glib8t64:arm64.
199s Preparing to unpack .../166-libpoppler-glib8t64_25.03.0-3_arm64.deb ...
199s Unpacking libpoppler-glib8t64:arm64 (25.03.0-3) ...
199s Selecting previously unselected package gir1.2-poppler-0.18:arm64.
199s Preparing to unpack .../167-gir1.2-poppler-0.18_25.03.0-3_arm64.deb ...
199s Unpacking gir1.2-poppler-0.18:arm64 (25.03.0-3) ...
199s Selecting previously unselected package gir1.2-rsvg-2.0:arm64.
199s Preparing to unpack .../168-gir1.2-rsvg-2.0_2.60.0+dfsg-1_arm64.deb ...
199s Unpacking gir1.2-rsvg-2.0:arm64 (2.60.0+dfsg-1) ...
199s Selecting previously unselected package libimage-exiftool-perl.
199s Preparing to unpack .../169-libimage-exiftool-perl_13.25+dfsg-1_all.deb ...
199s Unpacking libimage-exiftool-perl (13.25+dfsg-1) ...
199s Selecting previously unselected package python3-cairo.
199s Preparing to unpack .../170-python3-cairo_1.27.0-2_arm64.deb ...
199s Unpacking python3-cairo (1.27.0-2) ...
199s Selecting previously unselected package python3-gi-cairo.
199s Preparing to unpack .../171-python3-gi-cairo_3.50.0-4build1_arm64.deb ...
199s Unpacking python3-gi-cairo (3.50.0-4build1) ...
199s Selecting previously unselected package python3-mutagen.
199s Preparing to unpack .../172-python3-mutagen_1.47.0-1_all.deb ...
199s Unpacking python3-mutagen (1.47.0-1) ...
199s Selecting previously unselected package mat2.
199s Preparing to unpack .../173-mat2_0.13.5-1_all.deb ...
199s Unpacking mat2 (0.13.5-1) ...
199s Selecting previously unselected package python3-iniconfig.
199s Preparing to unpack .../174-python3-iniconfig_1.1.1-2_all.deb ...
199s Unpacking python3-iniconfig (1.1.1-2) ...
199s Selecting previously unselected package python3-packaging.
199s Preparing to unpack .../175-python3-packaging_24.2-1_all.deb ...
199s Unpacking python3-packaging (24.2-1) ...
199s Selecting previously unselected package python3-pluggy.
199s Preparing to unpack .../176-python3-pluggy_1.5.0-1_all.deb ...
199s Unpacking python3-pluggy (1.5.0-1) ...
199s Selecting previously unselected package python3-pytest.
199s Preparing to unpack .../177-python3-pytest_8.3.5-1_all.deb ...
199s Unpacking python3-pytest (8.3.5-1) ...
199s Setting up libgme0:arm64 (0.6.3-7build1) ...
199s Setting up libchromaprint1:arm64 (1.5.1-7) ...
199s Setting up libhwy1t64:arm64 (1.2.0-3ubuntu3) ...
199s Setting up libgraphite2-3:arm64 (1.3.14-2ubuntu1) ...
199s Setting up libxcb-dri3-0:arm64 (1.17.0-2) ...
199s Setting up liblcms2-2:arm64 (2.16-2) ...
199s Setting up python3-iniconfig (1.1.1-2) ...
200s Setting up libpixman-1-0:arm64 (0.44.0-3) ...
200s Setting up libdvdread8t64:arm64 (6.1.3-2) ...
200s Setting up libudfread0:arm64 (1.1.2-1build1) ...
200s Setting up libnorm1t64:arm64 (1.5.9+dfsg-3.1build1) ...
200s Setting up libsharpyuv0:arm64 (1.5.0-0.1) ...
200s Setting up libgpgmepp6t64:arm64 (1.24.2-1ubuntu2) ...
200s Setting up libwayland-server0:arm64 (1.23.1-3) ...
200s Setting up libaom3:arm64 (3.12.0-1) ...
200s Setting up libx11-xcb1:arm64 (2:1.8.10-2) ...
200s Setting up librabbitmq4:arm64 (0.15.0-1) ...
200s Setting up libraw1394-11:arm64 (2.1.2-2build3) ...
200s Setting up libsodium23:arm64 (1.0.18-1build3) ...
200s Setting up libxcb-xfixes0:arm64 (1.17.0-2) ...
200s Setting up libogg0:arm64 (1.3.5-3build1) ...
200s Setting up liblerc4:arm64 (4.0.0+ds-5ubuntu1) ...
200s Setting up libspeex1:arm64 (1.2.1-3) ...
200s Setting up libshine3:arm64 (3.1.1-2build1) ...
200s Setting up libcaca0:arm64 (0.99.beta20-5) ...
200s Setting up libxi6:arm64 (2:1.8.2-1) ...
200s Setting up libx264-164:arm64 (2:0.164.3108+git31e19f9-2build2) ...
200s Setting up libtwolame0:arm64 (0.4.0-2build3) ...
200s Setting up libxrender1:arm64 (1:0.9.10-1.1build1) ...
200s Setting up libdatrie1:arm64 (0.2.13-3build1) ...
200s Setting up libgsm1:arm64 (1.0.22-1build1) ...
200s Setting up libxcb-render0:arm64 (1.17.0-2) ...
200s Setting up libzix-0-0:arm64 (0.6.2-1) ...
200s Setting up libglvnd0:arm64 (1.7.0-1build1) ...
200s Setting up libcodec2-1.2:arm64 (1.2.0-3) ...
200s Setting up libxcb-glx0:arm64 (1.17.0-2) ...
200s Setting up libgdk-pixbuf2.0-common (2.42.12+dfsg-2) ...
200s Setting up libmysofa1:arm64 (1.3.3+dfsg-1ubuntu1) ...
200s Setting up python3-mutagen (1.47.0-1) ...
200s Setting up libxcb-shape0:arm64 (1.17.0-2) ...
200s Setting up x11-common (1:7.7+23ubuntu4) ...
200s Setting up libcdio19t64:arm64 (2.2.0-1) ...
200s Setting up libdeflate0:arm64 (1.23-1) ...
200s Setting up libxcb-shm0:arm64 (1.17.0-2) ...
200s Setting up libmpg123-0t64:arm64 (1.32.10-1) ...
200s Setting up libgomp1:arm64 (15-20250404-0ubuntu1) ...
200s Setting up libcjson1:arm64 (1.7.18-3) ...
200s Setting up libxvidcore4:arm64 (2:1.3.7-1build1) ...
200s Setting up libjbig0:arm64 (2.1-6.1ubuntu2) ...
200s Setting up libimage-exiftool-perl (13.25+dfsg-1) ...
200s Setting up libxxf86vm1:arm64 (1:1.1.4-1build4) ...
200s Setting up libsnappy1v5:arm64 (1.2.1-1) ...
200s Setting up libcdio-cdda2t64:arm64 (10.2+2.0.2-1) ...
200s Setting up libxcb-present0:arm64 (1.17.0-2) ...
200s Setting up libasound2-data (1.2.13-1build1) ...
200s Setting up libpgm-5.3-0t64:arm64 (5.3.128~dfsg-2.1build1) ...
200s Setting up libtheoraenc1:arm64 (1.2.0~alpha1+dfsg-6) ...
200s Setting up libblas3:arm64 (3.12.1-2) ...
200s update-alternatives: using /usr/lib/aarch64-linux-gnu/blas/libblas.so.3 to provide /usr/lib/aarch64-linux-gnu/libblas.so.3 (libblas.so.3-aarch64-linux-gnu) in auto mode
200s Setting up python3-packaging (24.2-1) ...
200s Setting up libasound2t64:arm64 (1.2.13-1build1) ...
200s Setting up libva2:arm64 (2.22.0-3ubuntu2) ...
200s Setting up libsvtav1enc2:arm64 (2.3.0+dfsg-1) ...
200s Setting up libxfixes3:arm64 (1:6.0.0-2build1) ...
200s Setting up libxcb-sync1:arm64 (1.17.0-2) ...
200s Setting up libopus0:arm64 (1.5.2-2) ...
200s Setting up libcdio-paranoia2t64:arm64 (10.2+2.0.2-1) ...
200s Setting up libdc1394-25:arm64 (2.2.6-4build1) ...
200s Setting up libxv1:arm64 (2:1.0.11-1.1build1) ...
200s Setting up fonts-dejavu-mono (2.37-8) ...
200s Setting up libvorbis0a:arm64 (1.3.7-2) ...
200s Setting up libxrandr2:arm64 (2:1.5.4-1) ...
200s Setting up fonts-dejavu-core (2.37-8) ...
201s Setting up libflac14:arm64 (1.5.0+ds-2) ...
201s Setting up libjpeg-turbo8:arm64 (2.1.5-3ubuntu2) ...
201s Setting up libfftw3-double3:arm64 (3.3.10-2fakesync1build1) ...
201s Setting up libssh-4:arm64 (0.11.1-1) ...
201s Setting up libgfortran5:arm64 (15-20250404-0ubuntu1) ...
201s Setting up libvulkan1:arm64 (1.4.304.0-1) ...
201s Setting up python3-pluggy (1.5.0-1) ...
201s Setting up libwebp7:arm64 (1.5.0-0.1) ...
201s Setting up libvidstab1.1:arm64 (1.1.0-2build1) ...
201s Setting up libvpx9:arm64 (1.15.0-2) ...
201s Setting up libsrt1.5-gnutls:arm64 (1.5.4-1) ...
201s Setting up libflite1:arm64 (2.2-7) ...
201s Setting up libdav1d7:arm64 (1.5.1-1) ...
201s Setting up libva-drm2:arm64 (2.22.0-3ubuntu2) ...
201s Setting up ocl-icd-libopencl1:arm64 (2.3.2-1build1) ...
201s Setting up libasyncns0:arm64 (0.8-6build4) ...
201s Setting up libxshmfence1:arm64 (1.3-1build5) ...
201s Setting up libvdpau1:arm64 (1.5-3) ...
201s Setting up libbs2b0:arm64 (3.1.0+dfsg-8) ...
201s Setting up libxcb-randr0:arm64 (1.17.0-2) ...
201s Setting up librav1e0.7:arm64 (0.7.1-9) ...
201s Setting up libzimg2:arm64 (3.0.5+ds1-1build1) ...
201s Setting up libopenjp2-7:arm64 (2.5.3-2) ...
201s Setting up libharfbuzz0b:arm64 (10.2.0-1) ...
201s Setting up libopenal-data (1:1.24.2-1) ...
201s Setting up libthai-data (0.1.29-2build1) ...
201s Setting up libunibreak6:arm64 (6.1-2) ...
201s Setting up libwayland-egl1:arm64 (1.23.1-3) ...
201s Setting up libxss1:arm64 (1:1.2.3-1build3) ...
201s Setting up libmbedcrypto16:arm64 (3.6.2-3ubuntu1) ...
201s Setting up libx265-215:arm64 (4.1-2) ...
201s Setting up libsamplerate0:arm64 (0.2.2-4build1) ...
201s Setting up libva-x11-2:arm64 (2.22.0-3ubuntu2) ...
201s Setting up libwebpmux3:arm64 (1.5.0-0.1) ...
201s Setting up libjxl0.11:arm64 (0.11.1-4) ...
201s Setting up libzvbi-common (0.2.44-1ubuntu1) ...
201s Setting up libmp3lame0:arm64 (3.100-6build1) ...
201s Setting up libvorbisenc2:arm64 (1.3.7-2) ...
201s Setting up libdvdnav4:arm64 (6.1.1-3build1) ...
201s Setting up libiec61883-0:arm64 (1.2.0-7) ...
201s Setting up libserd-0-0:arm64 (0.32.4-1) ...
201s Setting up libwayland-client0:arm64 (1.23.1-3) ...
201s Setting up libjpeg8:arm64 (8c-2ubuntu11) ...
201s Setting up libavc1394-0:arm64 (0.5.4-5build3) ...
201s Setting up mesa-libgallium:arm64 (25.0.3-1ubuntu2) ...
201s Setting up liblapack3:arm64 (3.12.1-2) ...
201s update-alternatives: using /usr/lib/aarch64-linux-gnu/lapack/liblapack.so.3 to provide /usr/lib/aarch64-linux-gnu/liblapack.so.3 (liblapack.so.3-aarch64-linux-gnu) in auto mode
201s Setting up libzmq5:arm64 (4.3.5-1build2) ...
201s Setting up libzvbi0t64:arm64 (0.2.44-1ubuntu1) ...
201s Setting up libgbm1:arm64 (25.0.3-1ubuntu2) ...
201s Setting up libsoxr0:arm64 (0.1.3-4build3) ...
201s Setting up fontconfig-config (2.15.0-2.2ubuntu1) ...
201s Setting up python3-pytest (8.3.5-1) ...
201s Setting up libxcursor1:arm64 (1:1.2.3-1) ...
201s Setting up libgl1-mesa-dri:arm64 (25.0.3-1ubuntu2) ...
201s Setting up libopenal1:arm64 (1:1.24.2-1) ...
201s Setting up libavutil59:arm64 (7:7.1.1-1ubuntu1) ...
201s Setting up libpostproc58:arm64 (7:7.1.1-1ubuntu1) ...
201s Setting up librist4:arm64 (0.2.11+dfsg-1) ...
201s Setting up libthai0:arm64 (0.1.29-2build1) ...
201s Setting up libvorbisfile3:arm64 (1.3.7-2) ...
201s Setting up libswresample5:arm64 (7:7.1.1-1ubuntu1) ...
201s Setting up libswscale8:arm64 (7:7.1.1-1ubuntu1) ...
201s Setting up libplacebo349:arm64 (7.349.0-3) ...
201s Setting up librubberband2:arm64 (3.3.0+dfsg-2build2) ...
201s Setting up libjack-jackd2-0:arm64 (1.9.22~dfsg-4) ...
201s Setting up libsord-0-0:arm64 (0.16.18-1) ...
201s Setting up libtiff6:arm64 (4.5.1+git230720-4ubuntu4) ...
201s Setting up libwayland-cursor0:arm64 (1.23.1-3) ...
201s Setting up libsratom-0-0:arm64 (0.6.18-1) ...
201s Setting up libdecor-0-0:arm64 (0.2.2-2) ...
201s Setting up libgdk-pixbuf-2.0-0:arm64 (2.42.12+dfsg-2) ...
201s Setting up libfontconfig1:arm64 (2.15.0-2.2ubuntu1) ...
201s Setting up libsndfile1:arm64 (1.2.2-2build1) ...
201s Setting up libbluray2:arm64 (1:1.3.4-1build1) ...
201s Setting up liblilv-0-0:arm64 (0.24.26-1) ...
201s Setting up libopenmpt0t64:arm64 (0.7.13-1build1) ...
201s Setting up fontconfig (2.15.0-2.2ubuntu1) ...
203s Regenerating fonts cache... done.
203s Setting up libglx-mesa0:arm64 (25.0.3-1ubuntu2) ...
203s Setting up libpoppler147:arm64 (25.03.0-3) ...
203s Setting up libglx0:arm64 (1.7.0-1build1) ...
203s Setting up gir1.2-gdkpixbuf-2.0:arm64 (2.42.12+dfsg-2) ...
203s Setting up libpulse0:arm64 (1:17.0+dfsg1-2ubuntu1) ...
203s Setting up libpango-1.0-0:arm64 (1.56.3-1) ...
203s Setting up libcairo2:arm64 (1.18.4-1) ...
203s Setting up libpoppler-glib8t64:arm64 (25.03.0-3) ...
203s Setting up libsphinxbase3t64:arm64 (0.8+5prealpha+1-21build1) ...
203s Setting up libgl1:arm64 (1.7.0-1build1) ...
203s Setting up libass9:arm64 (1:0.17.3-1) ...
203s Setting up libtheoradec1:arm64 (1.2.0~alpha1+dfsg-6) ...
203s Setting up libcairo-gobject2:arm64 (1.18.4-1) ...
203s Setting up libpangoft2-1.0-0:arm64 (1.56.3-1) ...
203s Setting up libsdl2-2.0-0:arm64 (2.32.2+dfsg-2) ...
203s Setting up libpangocairo-1.0-0:arm64 (1.56.3-1) ...
203s Setting up gir1.2-freedesktop:arm64 (1.84.0-1) ...
203s Setting up python3-cairo (1.27.0-2) ...
204s Setting up librsvg2-2:arm64 (2.60.0+dfsg-1) ...
204s Setting up libpocketsphinx3:arm64 (0.8.0+real5prealpha+1-15ubuntu5) ...
204s Setting up libavcodec61:arm64 (7:7.1.1-1ubuntu1) ...
204s Setting up gir1.2-poppler-0.18:arm64 (25.03.0-3) ...
204s Setting up gir1.2-rsvg-2.0:arm64 (2.60.0+dfsg-1) ...
204s Setting up python3-gi-cairo (3.50.0-4build1) ...
204s Setting up mat2 (0.13.5-1) ...
204s Setting up libavformat61:arm64 (7:7.1.1-1ubuntu1) ...
204s Setting up libavfilter10:arm64 (7:7.1.1-1ubuntu1) ...
204s Setting up libavdevice61:arm64 (7:7.1.1-1ubuntu1) ...
204s Setting up ffmpeg (7:7.1.1-1ubuntu1) ...
204s Processing triggers for man-db (2.13.0-1) ...
205s Processing triggers for libc-bin (2.41-6ubuntu1) ...
206s autopkgtest [09:30:29]: test command1: MAT2_GLOBAL_PATH_TESTSUITE= pytest-3
206s autopkgtest [09:30:29]: test command1: [-----------------------
207s ============================= test session starts ==============================
207s platform linux -- Python 3.13.3, pytest-8.3.5, pluggy-1.5.0
207s rootdir: /tmp/autopkgtest.Hd0Bed/build.38p/src
207s configfile: pyproject.toml
207s plugins: typeguard-4.4.2
207s collected 125 items
207s 
235s tests/test_climat2.py .........................                          [ 20%]
238s tests/test_corrupted_files.py .......................................... [ 53%]
238s                                                                          [ 53%]
241s tests/test_deep_cleaning.py .....                                        [ 57%]
279s tests/test_libmat2.py .................................F..............   [ 96%]
284s tests/test_lightweight_cleaning.py ..                                    [ 97%]
284s tests/test_policy.py ...                                                 [100%]
284s 
284s =================================== FAILURES ===================================
284s _______________________ TestCleaning.test_all_parametred _______________________
284s 
284s self = <tests.test_libmat2.TestCleaning testMethod=test_all_parametred>
284s 
284s     def test_all_parametred(self):
284s         for case in self.data:
284s             with self.subTest(case=case):
284s                 if 'ffmpeg' in case:
284s                     try:
284s                         video._get_ffmpeg_path()
284s                     except RuntimeError:
284s                         raise unittest.SkipTest
284s     
284s                 print('[+] Testing %s' % case['name'])
284s                 target = './tests/data/clean.' + case['name']
284s                 shutil.copy('./tests/data/dirty.' + case['name'], target)
284s                 p1 = case['parser'](target)
284s     
284s                 for k, v in p1.get_meta().items():
284s                     if k not in case['meta']:
284s                         continue
284s                     if isinstance(v, dict):
284s                         for _k, _v in v.items():
284s                             if _k in case['meta'][k]:
284s                                 self.assertEqual(_v, case['meta'][k][_k])
284s                     else:
284s                         self.assertEqual(v, case['meta'][k])
284s     
284s                 p1.lightweight_cleaning = True
284s                 self.assertTrue(p1.remove_all())
284s     
284s                 p2 = case['parser'](p1.output_filename)
284s                 meta = p2.get_meta()
284s                 if meta:
284s                     for k, v in p2.get_meta().items():
284s >                       self.assertIn(k, case['expected_meta'], '"%s" is not in "%s" (%s)' % (k, case['expected_meta'], case['name']))
284s E                       AssertionError: 'ProfileCMMType' not found in {'ExifByteOrder': 'Big-endian (Motorola, MM)', 'Warning': 'Bad IFD0 directory'} : "ProfileCMMType" is not in "{'ExifByteOrder': 'Big-endian (Motorola, MM)', 'Warning': 'Bad IFD0 directory'}" (heic)
284s 
284s tests/test_libmat2.py:566: AssertionError
284s ----------------------------- Captured stdout call -----------------------------
284s [+] Testing pdf
284s [+] Testing png
284s [+] Testing jpg
284s [+] Testing wav
284s [+] Testing aiff
284s [+] Testing mp3
284s [+] Testing ogg
284s [+] Testing flac
284s [+] Testing docx
284s [+] Testing odt
284s [+] Testing tiff
284s [+] Testing bmp
284s [+] Testing torrent
284s [+] Testing odf
284s [+] Testing odg
284s [+] Testing txt
284s [+] Testing gif
284s [+] Testing css
284s [+] Testing svg
284s [+] Testing ppm
284s [+] Testing avi
284s [+] Testing mp4
284s [+] Testing wmv
284s [+] Testing heic
284s ----------------------------- Captured stderr call -----------------------------
284s Warning: [minor] Can't delete IFD0 from TIFF - ./tests/data/clean.tiff
284s Warning: Not deleting permanent ICC_Profile directory - ./tests/data/clean.heic
284s ------------------------------ Captured log call -------------------------------
284s WARNING  root:video.py:19 The format of "./tests/data/clean.mp4" (video/mp4) has some mandatory metadata fields; mat2 filled them with standard data.
284s WARNING  root:video.py:19 The format of "./tests/data/clean.cleaned.mp4" (video/mp4) has some mandatory metadata fields; mat2 filled them with standard data.
284s WARNING  root:video.py:19 The format of "./tests/data/clean.wmv" (video/x-ms-wmv) has some mandatory metadata fields; mat2 filled them with standard data.
284s WARNING  root:video.py:19 The format of "./tests/data/clean.cleaned.wmv" (video/x-ms-wmv) has some mandatory metadata fields; mat2 filled them with standard data.
284s =============================== warnings summary ===============================
284s tests/test_corrupted_files.py: 8 warnings
284s tests/test_libmat2.py: 27 warnings
284s   /tmp/autopkgtest.Hd0Bed/build.38p/src/libmat2/archive.py:155: DeprecationWarning: Python 3.14 will, by default, filter extracted tar archives and reject files or modify their metadata. Use the filter argument to control this behavior.
284s     zin.extract(member=item, path=temp_folder)
284s 
284s tests/test_corrupted_files.py: 7 warnings
284s tests/test_libmat2.py: 24 warnings
284s   /tmp/autopkgtest.Hd0Bed/build.38p/src/libmat2/archive.py:207: DeprecationWarning: Python 3.14 will, by default, filter extracted tar archives and reject files or modify their metadata. Use the filter argument to control this behavior.
284s     zin.extract(member=item, path=temp_folder)
284s 
284s tests/test_libmat2.py::TestCleaningArchives::test_tar
284s   /tmp/autopkgtest.Hd0Bed/build.38p/src/tests/test_libmat2.py:701: DeprecationWarning: Python 3.14 will, by default, filter extracted tar archives and reject files or modify their metadata. Use the filter argument to control this behavior.
284s     zout.extractall(path=tmp_dir)
284s 
284s tests/test_libmat2.py::TestCleaningArchives::test_tarbz2
284s   /tmp/autopkgtest.Hd0Bed/build.38p/src/tests/test_libmat2.py:771: DeprecationWarning: Python 3.14 will, by default, filter extracted tar archives and reject files or modify their metadata. Use the filter argument to control this behavior.
284s     zout.extractall(path=tmp_dir)
284s 
284s tests/test_libmat2.py::TestCleaningArchives::test_targz
284s   /tmp/autopkgtest.Hd0Bed/build.38p/src/tests/test_libmat2.py:736: DeprecationWarning: Python 3.14 will, by default, filter extracted tar archives and reject files or modify their metadata. Use the filter argument to control this behavior.
284s     zout.extractall(path=tmp_dir)
284s 
284s tests/test_libmat2.py::TestCleaningArchives::test_tarxz
284s   /tmp/autopkgtest.Hd0Bed/build.38p/src/tests/test_libmat2.py:806: DeprecationWarning: Python 3.14 will, by default, filter extracted tar archives and reject files or modify their metadata. Use the filter argument to control this behavior.
284s     zout.extractall(path=tmp_dir)
284s 
284s -- Docs: https://docs.pytest.org/en/stable/how-to/capture-warnings.html
284s =========================== short test summary info ============================
284s FAILED tests/test_libmat2.py::TestCleaning::test_all_parametred - AssertionEr...
284s ============ 1 failed, 124 passed, 70 warnings in 76.96s (0:01:16) =============
284s autopkgtest [09:31:47]: test command1: -----------------------]
285s autopkgtest [09:31:48]: test command1:  - - - - - - - - - - results - - - - - - - - - -
285s command1             FAIL non-zero exit status 1
285s autopkgtest [09:31:48]: @@@@@@@@@@@@@@@@@@@@ summary
285s command1             FAIL non-zero exit status 1
302s nova [W] Using flock in prodstack6-arm64
302s Creating nova instance adt-plucky-arm64-mat2-20250414-092703-juju-7f2275-prod-proposed-migration-environment-23-992e9178-8c0b-41e7-8ee8-36f44ca968cc from image adt/ubuntu-plucky-arm64-server-20250414.img (UUID 9726ef59-66f3-4d3e-972f-cefa0b96da61)...
302s nova [W] Timed out waiting for 8f813388-c747-495b-8cf0-54fbcc9f063a to get deleted.